[Top][All Lists]

[Date Prev][Date Next][Thread Prev][Thread Next][Date Index][Thread Index]

[Guile-commits] Hydra job gnu:guile-2-0:build_disable_posix build 110000

From: Hydra Build Daemon
Subject: [Guile-commits] Hydra job gnu:guile-2-0:build_disable_posix build 1100005: Failed
Date: Fri, 27 May 2011 16:38:18 +0200


This is to let you know that Hydra build 1100005 of job 
gnu:guile-2-0:build_disable_posix has changed from 'Failed with non-zero exit 
code' to 'Failed'.

Complete build information can be found on this page:

The last 50 lines of the build log are shown at the bottom of this email.

A summary of the build information follows:

Build ID:              | 1100005
Nix name:              | guile-disable-posix-
Short description:     | Native Nix build on x86_64-linux
Maintainer(s):         | address@hidden
System:                | x86_64-linux
Derivation store path: | 
Output store path:     | 
Time added:            | 2011-05-27 16:38:18
Build started:         | 2011-05-27 16:28:33
Build finished:        | 2011-05-27 16:38:18
Duration:              | 585s

The build inputs were:

Name        | Type  | Value
hydraConfig | svn   |
nixpkgs     | svn   |
tarball     | build | 1099999


The Hydra build daemon.

 356: 1 [eval #<memoized status:exit-val> #<directory (guile-user) 106a090>]
In unknown file:
   ?: 0 [memoize-variable-access! # #]

ERROR: In procedure memoize-variable-access!:
ERROR: Unbound variable: status:exit-val
FAIL: test-system-cmds
PASS: test-bad-identifiers
PASS: test-require-extension
PASS: test-guile-snarf
PASS: test-import-order
PASS: test-num2integral
PASS: test-round
PASS: test-asmobs
PASS: test-ffi
PASS: test-list
PASS: test-unwind
PASS: test-conversion
PASS: test-loose-ends
PASS: test-fast-slot-ref
PASS: test-mb-regexp
PASS: test-use-srfi
PASS: test-scm-c-read
PASS: test-scm-take-locale-symbol
PASS: test-scm-take-u8vector
PASS: test-extensions
PASS: test-with-guile-module
PASS: test-scm-with-guile
PASS: test-scm-spawn-thread
PASS: test-pthread-create
SKIP: test-pthread-create-secondary
1 of 24 tests failed
(1 test was not run)
Please report to address@hidden
make[5]: *** [check-TESTS] Error 1
make[5]: Leaving directory 
make[4]: *** [check-am] Error 2
make[4]: Leaving directory 
make[3]: *** [check] Error 2
make[3]: Leaving directory 
make[2]: *** [check-recursive] Error 1
make[2]: Leaving directory 
make[1]: *** [check-recursive] Error 1
make[1]: Leaving directory 
make: *** [check] Error 2
build time elapsed:  0m0.021s 0m0.008s 8m42.494s 0m34.022s
Copying build directory to 
build failed with exit code 2 (ignored)

reply via email to

[Prev in Thread] Current Thread [Next in Thread]