[Top][All Lists]

[Date Prev][Date Next][Thread Prev][Thread Next][Date Index][Thread Index]

[Guile-commits] Hydra job gnu:guile-2-0:build build 1146860: Failed

From: Hydra Build Daemon
Subject: [Guile-commits] Hydra job gnu:guile-2-0:build build 1146860: Failed
Date: Wed, 6 Jul 2011 13:38:23 +0200


This is to let you know that Hydra build 1146860 of job gnu:guile-2-0:build has 
changed from 'Failed' to 'Failed'.

Complete build information can be found on this page:

The last 50 lines of the build log are shown at the bottom of this email.

A summary of the build information follows:

Build ID:              | 1146860
Nix name:              | guile-
Short description:     | Native Nix build on i686-cygwin
Maintainer(s):         | address@hidden
System:                | i686-cygwin
Derivation store path: | 
Output store path:     | 
Time added:            | 2011-07-06 13:38:22
Build started:         | 2011-07-06 13:13:04
Build finished:        | 2011-07-06 13:38:22
Duration:              | 1518s

The build inputs were:

Name        | Type   | Value
hydraConfig | svn    |
nixpkgs     | svn    |
system      | string | i686-cygwin
tarball     | build  | 1146807


The Hydra build daemon.

Running 00-initial-env.test
Running alist.test
Running and-let-star.test
Running arbiters.test
Running arrays.test
Running asm-to-bytecode.test
Running bit-operations.test
Running bitvectors.test
Running brainfuck.test
Running bytevectors.test
Running c-api.test
Running chars.test
Running coding.test
Running common-list.test
Running continuations.test
Running control.test
Running coverage.test
ERROR: coverage.test: procedure-execution-count: called from C - arguments: 
((misc-error "dynamic-pointer" "Symbol not found: ~a" ("scm_call_2") #f))
Running curried-definitions.test
Running ecmascript.test
Running elisp-compiler.test
UNRESOLVED: elisp-compiler.test: Exceptions: catch and throw
UNRESOLVED: elisp-compiler.test: Equivalence Predicates: eq
Running elisp-reader.test
Running elisp.test
Running eval-string.test
Running eval.test
UNRESOLVED: eval.test: stacks: stack involving a subr
UNRESOLVED: eval.test: stacks: stack involving a gsubr
UNRESOLVED: eval.test: stacks: arguments of a gsubr stack frame
Running exceptions.test
Running filesys.test
Running fluids.test
Running foreign.test
ERROR: foreign.test: make-pointer: equal? modulo finalizer - arguments: 
((misc-error "dynamic-pointer" "Symbol not found: ~a" ("scm_is_pair") #f))
FAIL: check-guile
1 of 1 test failed
Please report to address@hidden
make[3]: *** [check-TESTS] Error 1
make[3]: Leaving directory 
make[2]: *** [check-am] Error 2
make[2]: Leaving directory 
make[1]: *** [check-recursive] Error 1
make[1]: Leaving directory 
make: *** [check] Error 2
build time elapsed:  0m0.046s 0m0.046s 26m22.331s 7m49.333s
Copying build directory to 
build failed with exit code 2 (ignored)

reply via email to

[Prev in Thread] Current Thread [Next in Thread]