[Top][All Lists]

[Date Prev][Date Next][Thread Prev][Thread Next][Date Index][Thread Index]

[Guile-commits] Hydra job gnu:guile-master:build_gcc3 build 1542794: Fai

From: Hydra Build Daemon
Subject: [Guile-commits] Hydra job gnu:guile-master:build_gcc3 build 1542794: Failed
Date: Wed, 9 Nov 2011 18:24:38 +0100


This is to let you know that Hydra build 1542794 of job 
gnu:guile-master:build_gcc3 has changed from 'Failed' to 'Failed'.

Complete build information can be found on this page:

The last 50 lines of the build log are shown at the bottom of this email.

A summary of the build information follows:

Build ID:              | 1542794
Nix name:              | guile-
Short description:     | Native Nix build on x86_64-linux
Maintainer(s):         | address@hidden
System:                | x86_64-linux
Derivation store path: | 
Output store path:     | 
Time added:            | 2011-11-09 18:24:38
Build started:         | 2011-11-09 17:33:25
Build finished:        | 2011-11-09 18:24:38
Duration:              | 3073s

The build inputs were:

Name        | Type  | Value
hydraConfig | git   | 
nixpkgs     | svn   |
tarball     | build | 1542783


The Hydra build daemon.

make[5]: Leaving directory 
make  check-TESTS
make[5]: Entering directory 
building check-TESTS
PASS: test-system-cmds
PASS: test-bad-identifiers
PASS: test-require-extension
PASS: test-guile-snarf
PASS: test-import-order
PASS: test-num2integral
PASS: test-round
PASS: test-asmobs
PASS: test-ffi
PASS: test-list
PASS: test-unwind
PASS: test-conversion
PASS: test-loose-ends
/bin/sh: line 5: 43971 Aborted                 
srcdir="../../../guile-" builddir="." 
GUILE_AUTO_COMPILE=0 "../../meta/uninstalled-env" ${dir}$tst
FAIL: test-fast-slot-ref
PASS: test-mb-regexp
PASS: test-use-srfi
PASS: test-scm-c-read
PASS: test-scm-take-locale-symbol
PASS: test-scm-take-u8vector
PASS: test-scm-to-latin1-string
PASS: test-extensions
PASS: test-with-guile-module
PASS: test-scm-with-guile
PASS: test-scm-spawn-thread
PASS: test-pthread-create
SKIP: test-pthread-create-secondary
1 of 25 tests failed
(1 test was not run)
Please report to address@hidden
make[5]: *** [check-TESTS] Error 1
make[5]: Leaving directory 
make[4]: *** [check-am] Error 2
make[4]: Leaving directory 
make[3]: *** [check] Error 2
make[3]: Leaving directory 
make[2]: *** [check-recursive] Error 1
make[2]: Leaving directory 
make[1]: *** [check-recursive] Error 1
make[1]: Leaving directory 
make: *** [check] Error 2
build time elapsed:  0m0.036s 0m0.022s 37m31.549s 4m20.445s
Copying build directory to 
build failed with exit code 2 (ignored)

reply via email to

[Prev in Thread] Current Thread [Next in Thread]