[Top][All Lists]

[Date Prev][Date Next][Thread Prev][Thread Next][Date Index][Thread Index]

[Guile-commits] Hydra job gnu:guile-2-0:build_without_threads build 1964

From: Hydra Build Daemon
Subject: [Guile-commits] Hydra job gnu:guile-2-0:build_without_threads build 1964984: Failed with non-zero exit code
Date: Thu, 2 Feb 2012 05:35:01 +0100


This is to let you know that Hydra build 1964984 of job 
gnu:guile-2-0:build_without_threads has changed from 'Success' to 'Failed with 
non-zero exit code'.

Complete build information can be found on this page:

The last 50 lines of the build log are shown at the bottom of this email.

A summary of the build information follows:

Build ID:              | 1964984
Nix name:              | guile-without-threads
Short description:     | Native Nix build on x86_64-freebsd
Maintainer(s):         | address@hidden
System:                | x86_64-freebsd
Derivation store path: | 
Output store path:     | 
Time added:            | 2012-02-02 05:35:01
Build started:         | 2012-02-02 05:15:39
Build finished:        | 2012-02-02 05:35:01
Duration:              | 1162s

The build inputs were:

Name        | Type   | Value
hydraConfig | git    | 
nixpkgs     | svn    |
system      | string | x86_64-freebsd
tarball     | build  | 1964966


The Hydra build daemon.

Running sxml.transform.test
Running sxml.xpath.test
Running symbols.test
Running syncase.test
Running syntax.test
UNRESOLVED: syntax.test: letrec: bindings: initial bindings are undefined
UNRESOLVED: syntax.test: letrec*: bindings: initial bindings are undefined
Running texinfo.docbook.test
Running texinfo.serialize.test
Running texinfo.string-utils.test
Running texinfo.test
Running threads.test
Running time.test
Running tree-il.test
UNRESOLVED: tree-il.test: warnings: unused-toplevel: used by macro
Running version.test
UNRESOLVED: version.test: version reporting works
Running vlist.test
Running weaks.test
Running web-http.test
Running web-request.test
Running web-response.test
Running web-uri.test

Totals for this test run:
passes:                 34826
failures:               1
unexpected passes:      0
expected failures:      30
unresolved test cases:  36
untested test cases:    1
unsupported test cases: 15
errors:                 0

WARNING: (test-suite sxml-xpath): imported module (sxml xpath) overrides core 
binding `filter'
FAIL: check-guile
1 of 1 test failed
Please report to address@hidden
gmake[3]: *** [check-TESTS] Error 1
gmake[3]: Leaving directory 
gmake[2]: *** [check-am] Error 2
gmake[2]: Leaving directory 
gmake[1]: *** [check-recursive] Error 1
gmake[1]: Leaving directory 
gmake: *** [check] Error 2
build time elapsed:  0m0.007s 0m0.007s 4m31.491s 0m26.226s
builder for 
`/nix/store/ip8qp7dg68lb3g10gibrs7jcb2yp6sa8-guile-without-threads.drv' failed 
with exit code 2
error: build of 
`/nix/store/ip8qp7dg68lb3g10gibrs7jcb2yp6sa8-guile-without-threads.drv' failed

reply via email to

[Prev in Thread] Current Thread [Next in Thread]