[Top][All Lists]

[Date Prev][Date Next][Thread Prev][Thread Next][Date Index][Thread Index]

[Guile-commits] Hydra job gnu:guile-2-0:build_without_threads build 1973

From: Hydra Build Daemon
Subject: [Guile-commits] Hydra job gnu:guile-2-0:build_without_threads build 1973290: Failed with non-zero exit code
Date: Fri, 3 Feb 2012 18:26:46 +0100


This is to let you know that Hydra build 1973290 of job 
gnu:guile-2-0:build_without_threads has changed from 'Success' to 'Failed with 
non-zero exit code'.

Complete build information can be found on this page:

The last 50 lines of the build log are shown at the bottom of this email.

A summary of the build information follows:

Build ID:              | 1973290
Nix name:              | guile-without-threads
Short description:     | Native Nix build on x86_64-freebsd
Maintainer(s):         | address@hidden
System:                | x86_64-freebsd
Derivation store path: | 
Output store path:     | 
Time added:            | 2012-02-03 18:26:45
Build started:         | 2012-02-03 18:06:51
Build finished:        | 2012-02-03 18:26:45
Duration:              | 1194s

The build inputs were:

Name        | Type   | Value
hydraConfig | git    | 
nixpkgs     | svn    |
system      | string | x86_64-freebsd
tarball     | build  | 1973216


The Hydra build daemon.

Running sxml.transform.test
Running sxml.xpath.test
Running symbols.test
Running syncase.test
Running syntax.test
UNRESOLVED: syntax.test: letrec: bindings: initial bindings are undefined
UNRESOLVED: syntax.test: letrec*: bindings: initial bindings are undefined
Running texinfo.docbook.test
Running texinfo.serialize.test
Running texinfo.string-utils.test
Running texinfo.test
Running threads.test
Running time.test
Running tree-il.test
UNRESOLVED: tree-il.test: warnings: unused-toplevel: used by macro
Running version.test
UNRESOLVED: version.test: version reporting works
Running vlist.test
Running weaks.test
Running web-http.test
Running web-request.test
Running web-response.test
Running web-uri.test

Totals for this test run:
passes:                 34826
failures:               0
unexpected passes:      0
expected failures:      30
unresolved test cases:  41
untested test cases:    1
unsupported test cases: 15
errors:                 8

WARNING: (test-suite sxml-xpath): imported module (sxml xpath) overrides core 
binding `filter'
FAIL: check-guile
1 of 1 test failed
Please report to address@hidden
gmake[3]: *** [check-TESTS] Error 1
gmake[3]: Leaving directory 
gmake[2]: *** [check-am] Error 2
gmake[2]: Leaving directory 
gmake[1]: *** [check-recursive] Error 1
gmake[1]: Leaving directory 
gmake: *** [check] Error 2
build time elapsed:  0m0.010s 0m0.004s 4m38.794s 0m28.312s
builder for 
`/nix/store/13sasfj9a7mrap3q5223mk53h71ffik2-guile-without-threads.drv' failed 
with exit code 2
error: build of 
`/nix/store/13sasfj9a7mrap3q5223mk53h71ffik2-guile-without-threads.drv' failed

reply via email to

[Prev in Thread] Current Thread [Next in Thread]