[Top][All Lists]

[Date Prev][Date Next][Thread Prev][Thread Next][Date Index][Thread Index]

[Guile-commits] Hydra job gnu:guile-master:build_without_threads build 2

From: Hydra Build Daemon
Subject: [Guile-commits] Hydra job gnu:guile-master:build_without_threads build 2059898: Failed with non-zero exit code
Date: Thu, 16 Feb 2012 11:13:18 +0100


This is to let you know that Hydra build 2059898 of job 
gnu:guile-master:build_without_threads has changed from 'Failed' to 'Failed 
with non-zero exit code'.

Complete build information can be found on this page:

The last 50 lines of the build log are shown at the bottom of this email.

A summary of the build information follows:

Build ID:              | 2059898
Nix name:              | guile-without-threads
Short description:     | Native Nix build on x86_64-linux
Maintainer(s):         | address@hidden
System:                | x86_64-linux
Derivation store path: | 
Output store path:     | 
Time added:            | 2012-02-16 11:13:18
Build started:         | 2012-02-16 10:45:06
Build finished:        | 2012-02-16 11:13:18
Duration:              | 1692s

The build inputs were:

Name        | Type   | Value
hydraConfig | git    | 
nixpkgs     | svn    |
tarball     | build  | 1569016
system      | string | x86_64-linux


The Hydra build daemon.

Running sxml.transform.test
Running sxml.xpath.test
Running symbols.test
Running syncase.test
Running syntax.test
UNRESOLVED: syntax.test: letrec: bindings: initial bindings are undefined
UNRESOLVED: syntax.test: letrec*: bindings: initial bindings are undefined
Running texinfo.docbook.test
Running texinfo.serialize.test
Running texinfo.string-utils.test
Running texinfo.test
Running threads.test
Running time.test
Running tree-il.test
UNRESOLVED: tree-il.test: warnings: unused-toplevel: used by macro
Running version.test
FAIL: version.test: version reporting works
Running vlist.test
Running weaks.test
Running web-http.test
Running web-request.test
Running web-response.test
Running web-uri.test

Totals for this test run:
passes:                 34198
failures:               1
unexpected passes:      0
expected failures:      31
unresolved test cases:  566
untested test cases:    1
unsupported test cases: 15
errors:                 0

WARNING: (test-suite sxml-xpath): imported module (sxml xpath) overrides core 
binding `filter'
FAIL: check-guile
1 of 1 test failed
Please report to address@hidden
make[3]: *** [check-TESTS] Error 1
make[3]: Leaving directory 
make[2]: *** [check-am] Error 2
make[2]: Leaving directory 
make[1]: *** [check-recursive] Error 1
make[1]: Leaving directory 
make: *** [check] Error 2
build time elapsed:  0m0.023s 0m0.006s 16m47.156s 0m40.858s
builder for 
`/nix/store/ngzs3gj2hqvd4bsqq5ja1i9kmvs91x5x-guile-without-threads.drv' failed 
with exit code 2
error: build of 
`/nix/store/ngzs3gj2hqvd4bsqq5ja1i9kmvs91x5x-guile-without-threads.drv' failed

reply via email to

[Prev in Thread] Current Thread [Next in Thread]