[Top][All Lists]

[Date Prev][Date Next][Thread Prev][Thread Next][Date Index][Thread Index]

[Guile-commits] Hydra job gnu:guile-master:build_disable_networking on x

From: Hydra Build Daemon
Subject: [Guile-commits] Hydra job gnu:guile-master:build_disable_networking on x86_64-linux, build 2381040: Failed with non-zero exit code
Date: Tue, 10 Apr 2012 19:29:08 +0200


This is to let you know that Hydra build 2381040 of job 
gnu:guile-master:build_disable_networking has changed from 'Success' to 'Failed 
with non-zero exit code'.

Complete build information can be found on this page:

The last 50 lines of the build log are shown at the bottom of this email.

A summary of the build information follows:

Build ID:              | 2381040
Nix name:              | guile-disable-networking-
Short description:     | Native Nix build on x86_64-linux
Maintainer(s):         | address@hidden
System:                | x86_64-linux
Derivation store path: | 
Output store path:     | 
Time added:            | 2012-04-10 19:29:08
Build started:         | 2012-04-10 18:59:25
Build finished:        | 2012-04-10 19:29:08
Duration:              | 1783s

The build inputs were:

Name        | Type  | Value
hydraConfig | git   | 
nixpkgs     | svn   |
guileSrc    | git   | 
tarball     | build | 2380818


The Hydra build daemon.

Running symbols.test
Running syncase.test
Running syntax.test
UNRESOLVED: syntax.test: letrec: bindings: initial bindings are undefined
UNRESOLVED: syntax.test: letrec*: bindings: initial bindings are undefined
Running texinfo.docbook.test
Running texinfo.serialize.test
Running texinfo.string-utils.test
Running texinfo.test
Running threads.test
Running time.test
Running tree-il.test
ERROR: tree-il.test: partial evaluation: resolve-primitives - arguments: 
((wrong-type-arg "struct_vtable" "Wrong type argument in position ~A (expecting 
~A): ~S" (1 "struct" #<procedure a194b80 at ice-9/boot-9.scm:1032:2 _>) 
(#<procedure a194b80 at ice-9/boot-9.scm:1032:2 _>)))
ERROR: tree-il.test: partial evaluation: resolve-primitives - arguments: 
((wrong-type-arg "struct_vtable" "Wrong type argument in position ~A (expecting 
~A): ~S" (1 "struct" #<procedure a196a20 at ice-9/boot-9.scm:1032:2 _>) 
(#<procedure a196a20 at ice-9/boot-9.scm:1032:2 _>)))
UNRESOLVED: tree-il.test: warnings: unused-toplevel: used by macro
Running version.test
UNRESOLVED: version.test: version reporting works
Running vlist.test
Running weaks.test
Running web-http.test
Running web-request.test
Running web-response.test
Running web-uri.test

Totals for this test run:
passes:                 34347
failures:               0
unexpected passes:      0
expected failures:      30
unresolved test cases:  569
untested test cases:    1
unsupported test cases: 9
errors:                 2

WARNING: (test-suite sxml-xpath): imported module (sxml xpath) overrides core 
binding `filter'
FAIL: check-guile
1 of 1 test failed
Please report to address@hidden
make[3]: *** [check-TESTS] Error 1
make[3]: Leaving directory 
make[2]: *** [check-am] Error 2
make[2]: Leaving directory 
make[1]: *** [check-recursive] Error 1
make[1]: Leaving directory 
make: *** [check] Error 2
build time elapsed:  0m0.038s 0m0.012s 27m37.858s 1m19.025s
builder for 
 failed with exit code 2
error: build of 

reply via email to

[Prev in Thread] Current Thread [Next in Thread]