[Top][All Lists]

[Date Prev][Date Next][Thread Prev][Thread Next][Date Index][Thread Index]

[Guile-commits] Hydra job gnu:guile-2-0:build_gcc47 on x86_64-linux, bui

From: Hydra Build Daemon
Subject: [Guile-commits] Hydra job gnu:guile-2-0:build_gcc47 on x86_64-linux, build 2477600: Failed with non-zero exit code
Date: Wed, 25 Apr 2012 16:06:28 +0200


This is to let you know that Hydra build 2477600 of job 
gnu:guile-2-0:build_gcc47 has changed from 'Success' to 'Failed with non-zero 
exit code'.

Complete build information can be found on this page:

The last 50 lines of the build log are shown at the bottom of this email.

A summary of the build information follows:

Build ID:              | 2477600
Nix name:              | guile-gcc47
Short description:     | Native Nix build on x86_64-linux
Maintainer(s):         | address@hidden
System:                | x86_64-linux
Derivation store path: | 
Output store path:     | /nix/store/kwcnwbhbxhmisfbmmw3qc96vla3w945g-guile-gcc47
Time added:            | 2012-04-25 16:06:28
Build started:         | 2012-04-25 15:40:43
Build finished:        | 2012-04-25 16:06:28
Duration:              | 1545s

The build inputs were:

Name        | Type  | Value
hydraConfig | git   | 
nixpkgs     | svn   |
tarball     | build | 2474027
guileSrc    | git   | 


The Hydra build daemon.

Running sxml.transform.test
Running sxml.xpath.test
Running symbols.test
Running syncase.test
Running syntax.test
UNRESOLVED: syntax.test: letrec: bindings: initial bindings are undefined
UNRESOLVED: syntax.test: letrec*: bindings: initial bindings are undefined
Running texinfo.docbook.test
Running texinfo.serialize.test
Running texinfo.string-utils.test
Running texinfo.test
Running threads.test
Running time.test
Running tree-il.test
UNRESOLVED: tree-il.test: warnings: unused-toplevel: used by macro
Running version.test
FAIL: version.test: version reporting works
Running vlist.test
Running weaks.test
Running web-http.test
Running web-request.test
Running web-response.test
Running web-uri.test

Totals for this test run:
passes:                 34427
failures:               1
unexpected passes:      0
expected failures:      30
unresolved test cases:  566
untested test cases:    1
unsupported test cases: 9
errors:                 0

WARNING: (test-suite sxml-xpath): imported module (sxml xpath) overrides core 
binding `filter'
FAIL: check-guile
1 of 1 test failed
Please report to address@hidden
make[3]: *** [check-TESTS] Error 1
make[3]: Leaving directory 
make[2]: *** [check-am] Error 2
make[2]: Leaving directory 
make[1]: *** [check-recursive] Error 1
make[1]: Leaving directory 
make: *** [check] Error 2
build time elapsed:  0m0.020s 0m0.013s 23m48.483s 0m43.346s
builder for `/nix/store/1h45ix0vb903fwm53idv2jd9fpjlh7pc-guile-gcc47.drv' 
failed with exit code 2
error: build of `/nix/store/1h45ix0vb903fwm53idv2jd9fpjlh7pc-guile-gcc47.drv' 

reply via email to

[Prev in Thread] Current Thread [Next in Thread]