[Top][All Lists]

[Date Prev][Date Next][Thread Prev][Thread Next][Date Index][Thread Index]

[Guile-commits] Hydra job gnu:guile-2-0:build on i686-linux, build 24776

From: Hydra Build Daemon
Subject: [Guile-commits] Hydra job gnu:guile-2-0:build on i686-linux, build 2477604: Failed with non-zero exit code
Date: Wed, 25 Apr 2012 16:31:24 +0200


This is to let you know that Hydra build 2477604 of job gnu:guile-2-0:build has 
changed from 'Success' to 'Failed with non-zero exit code'.

Complete build information can be found on this page:

The last 50 lines of the build log are shown at the bottom of this email.

A summary of the build information follows:

Build ID:              | 2477604
Nix name:              | guile-UNKNOWN
Short description:     | Native Nix build on i686-linux
Maintainer(s):         | address@hidden
System:                | i686-linux
Derivation store path: | 
Output store path:     | 
Time added:            | 2012-04-25 16:31:24
Build started:         | 2012-04-25 15:40:43
Build finished:        | 2012-04-25 16:31:24
Duration:              | 3041s

The build inputs were:

Name        | Type   | Value
hydraConfig | git    | 
nixpkgs     | svn    |
tarball     | build  | 2474027
guileSrc    | git    | 
system      | string | i686-linux


The Hydra build daemon.

Running sxml.transform.test
Running sxml.xpath.test
Running symbols.test
Running syncase.test
Running syntax.test
UNRESOLVED: syntax.test: letrec: bindings: initial bindings are undefined
UNRESOLVED: syntax.test: letrec*: bindings: initial bindings are undefined
Running texinfo.docbook.test
Running texinfo.serialize.test
Running texinfo.string-utils.test
Running texinfo.test
Running threads.test
Running time.test
Running tree-il.test
UNRESOLVED: tree-il.test: warnings: unused-toplevel: used by macro
Running version.test
FAIL: version.test: version reporting works
Running vlist.test
Running weaks.test
Running web-http.test
Running web-request.test
Running web-response.test
Running web-uri.test

Totals for this test run:
passes:                 34414
failures:               1
unexpected passes:      0
expected failures:      30
unresolved test cases:  579
untested test cases:    1
unsupported test cases: 9
errors:                 0

WARNING: (test-suite sxml-xpath): imported module (sxml xpath) overrides core 
binding `filter'
FAIL: check-guile
1 of 1 test failed
Please report to address@hidden
make[3]: *** [check-TESTS] Error 1
make[3]: Leaving directory 
make[2]: *** [check-am] Error 2
make[2]: Leaving directory 
make[1]: *** [check-recursive] Error 1
make[1]: Leaving directory 
make: *** [check] Error 2
build time elapsed:  0m0.038s 0m0.016s 48m13.979s 1m2.450s
builder for `/nix/store/6p0730wi2b4w3kapwrqkcsrya118jcj1-guile-UNKNOWN.drv' 
failed with exit code 2
error: build of `/nix/store/6p0730wi2b4w3kapwrqkcsrya118jcj1-guile-UNKNOWN.drv' 

reply via email to

[Prev in Thread] Current Thread [Next in Thread]