[Top][All Lists]

[Date Prev][Date Next][Thread Prev][Thread Next][Date Index][Thread Index]

[Guile-commits] Hydra job gnu:guile-master:build_gcc47 on x86_64-linux,

From: Hydra Build Daemon
Subject: [Guile-commits] Hydra job gnu:guile-master:build_gcc47 on x86_64-linux, build 3752753: Failed with non-zero exit code
Date: Tue, 15 Jan 2013 16:33:30 +0100


This is to let you know that Hydra build 3752753 of job 
gnu:guile-master:build_gcc47 has changed from 'Success' to 'Failed with 
non-zero exit code'.

Complete build information can be found on this page:

The last 50 lines of the build log are shown at the bottom of this email.

A summary of the build information follows:

Build ID:              | 3752753
Nix name:              | guile-gcc47
Short description:     | Native Nix build on x86_64-linux
Maintainer(s):         | address@hidden
System:                | x86_64-linux
Derivation store path: | 
Output store path:     | /nix/store/3rqkz429drs3j19ngg4iayr6xqmiacfc-guile-gcc47
Time added:            | 2013-01-15 16:33:30
Build started:         | 2013-01-15 15:40:27
Build finished:        | 2013-01-15 16:33:30
Duration:              | 3183s

The build inputs were:

Name        | Type | Value
hydraConfig | git  | 
nixpkgs     | git  | 
guile       | git  | 


The Hydra build daemon.

Running sxml.transform.test
Running sxml.xpath.test
Running symbols.test
Running syncase.test
Running syntax.test
UNRESOLVED: syntax.test: letrec: bindings: initial bindings are undefined
UNRESOLVED: syntax.test: letrec*: bindings: initial bindings are undefined
Running texinfo.docbook.test
Running texinfo.serialize.test
Running texinfo.string-utils.test
Running texinfo.test
Running threads.test
FAIL: threads.test: mutex-ownership: mutex with owner not retained (bug #27450)
Running time.test
Running tree-il.test
UNRESOLVED: tree-il.test: warnings: unused-toplevel: used by macro
Running version.test
UNRESOLVED: version.test: version reporting works
Running vlist.test
Running weaks.test
Running web-http.test
Running web-request.test
Running web-response.test
Running web-uri.test

Totals for this test run:
passes:                 34753
failures:               1
unexpected passes:      0
expected failures:      6
unresolved test cases:  565
untested test cases:    1
unsupported test cases: 9
errors:                 0

FAIL: check-guile
1 of 1 test failed
Please report to address@hidden
make[3]: *** [check-TESTS] Error 1
make[3]: Leaving directory `/tmp/nix-build-guile-gcc47.drv-1/build'
make[2]: *** [check-am] Error 2
make[2]: Leaving directory `/tmp/nix-build-guile-gcc47.drv-1/build'
make[1]: *** [check-recursive] Error 1
make[1]: Leaving directory `/tmp/nix-build-guile-gcc47.drv-1/build'
make: *** [check] Error 2
build time elapsed:  0m0.039s 0m0.019s 35m47.608s 1m19.910s
builder for `/nix/store/55lx2r51plnv424fj0j2ga6s9vhc8q6i-guile-gcc47.drv' 
failed with exit code 2
error: build of `/nix/store/55lx2r51plnv424fj0j2ga6s9vhc8q6i-guile-gcc47.drv' 

reply via email to

[Prev in Thread] Current Thread [Next in Thread]