[Top][All Lists]

[Date Prev][Date Next][Thread Prev][Thread Next][Date Index][Thread Index]

[Guile-commits] Hydra job gnu:guile-2-0:build on i686-linux, build 44618

From: Hydra Build Daemon
Subject: [Guile-commits] Hydra job gnu:guile-2-0:build on i686-linux, build 4461866: Failed
Date: Thu, 21 Mar 2013 19:48:27 +0100


This is to let you know that Hydra build 4461866 of job gnu:guile-2-0:build has 
changed from 'Success' to 'Failed'.

Complete build information can be found on this page:

The last 50 lines of the build log are shown at the bottom of this email.

A summary of the build information follows:

Build ID:              | 4461866
Nix name:              | guile-0pre
Short description:     | Nix package for i686-linux
Maintainer(s):         | address@hidden
System:                | i686-linux
Derivation store path: | 
Output store path:     | /nix/store/psggsdawwxcqh00mpyrp50jagj7w6sdc-guile-0pre
Time added:            | 2013-03-21 19:48:26
Build started:         | 2013-03-21 19:08:08
Build finished:        | 2013-03-21 19:48:26
Duration:              | 2418s

The build inputs were:

Name        | Type   | Value
hydraConfig | git    | 
nixpkgs     | git    | 
guile       | git    | 
system      | string | i686-linux


The Hydra build daemon.

Running srfi-26.test
Running srfi-27.test
Running srfi-31.test
Running srfi-34.test
Running srfi-35.test
Running srfi-37.test
Running srfi-38.test
Running srfi-39.test
Running srfi-4.test
Running srfi-42.test
Running srfi-45.test
Running srfi-6.test
Running srfi-60.test
Running srfi-67.test
Running srfi-69.test
Running srfi-88.test
Running srfi-9.test
Running statprof.test
Running strings.test
Running structs.test
Running sxml.fold.test
Running sxml.match.test
Running sxml.simple.test
Running sxml.ssax.test
Running sxml.transform.test
Running sxml.xpath.test
Running symbols.test
Running syncase.test
Running syntax.test
UNRESOLVED: syntax.test: letrec: bindings: initial bindings are undefined
UNRESOLVED: syntax.test: letrec*: bindings: initial bindings are undefined
Running texinfo.docbook.test
Running texinfo.serialize.test
Running texinfo.string-utils.test
Running texinfo.test
FAIL: check-guile
1 of 1 test failed
Please report to address@hidden
make[3]: *** [check-TESTS] Error 1
make[3]: Leaving directory `/tmp/nix-build-guile-0pre.drv-0/build'
make[2]: *** [check-am] Error 2
make[2]: Leaving directory `/tmp/nix-build-guile-0pre.drv-0/build'
make[1]: *** [check-recursive] Error 1
make[1]: Leaving directory `/tmp/nix-build-guile-0pre.drv-0/build'
make: *** [check] Error 2
build time elapsed:  0m0.021s 0m0.013s 19m27.437s 0m41.104s
Copying build directory to 
build failed with exit code 2 (ignored)

reply via email to

[Prev in Thread] Current Thread [Next in Thread]