[Top][All Lists]

[Date Prev][Date Next][Thread Prev][Thread Next][Date Index][Thread Index]

Re: guile-1.6.5 is even worse -- on Linux, no less

From: Bruce Korb
Subject: Re: guile-1.6.5 is even worse -- on Linux, no less
Date: Sun, 31 Oct 2004 10:45:54 -0800


The problem seems to be that, contrary to previous custom, using '='
in a path now causes build failure.  Must be some change in some
'auto*' tool that also has no effect on other projects.  I rebuilt
with 'XXXX' as the build directory and it all works fine, thus
it is some build tool problem.   *sigh*.

Bruce Korb wrote:
> $ ../config.guess
> i686-pc-linux-gnu
> $ cat /etc/redhat-release
> Red Hat Linux release 7.3 (Valhalla)
> Making install in libguile
> make[1]: Entering directory `/home/bkorb/tools/guile/guile-1.6.5/=b/libguile'
> cat alist.doc arbiters.doc async.doc backtrace.doc boolean.doc chars.doc 
> continuations.doc debug.doc dynl.doc dynwind.doc environments.doc eq.doc 
> error.doc eval.doc evalext.doc extensions.doc feature.doc fluids.doc 
> fports.doc gc.doc goops.doc gsubr.doc guardians.doc hash.doc hashtab.doc 
> hooks.doc init.doc ioext.doc iselect.doc keywords.doc lang.doc list.doc 
> load.doc macros.doc mallocs.doc modules.doc numbers.doc objects.doc 
> objprop.doc options.doc pairs.doc ports.doc print.doc procprop.doc procs.doc 
> properties.doc random.doc rdelim.doc read.doc root.doc rw.doc scmsigs.doc 
> script.doc simpos.doc smob.doc sort.doc srcprop.doc stackchk.doc stacks.doc 
> stime.doc strings.doc strop.doc strorder.doc strports.doc struct.doc 
> symbols.doc throw.doc values.doc variable.doc vectors.doc version.doc 
> vports.doc weaks.doc symbols-deprecated.doc ramap.doc unif.doc filesys.doc 
> posix.doc net_db.doc socket.doc regex-posix.doc | 
> GUILE="/home/bkorb/tools/guile/guile-1.6.5/=b/pre-inst-guile" ../../s
>  ipts/snarf-check-and-output-texi --manual > guile.texi || { rm guile.texi; 
> false; }
> /home/bkorb/tools/guile/guile-1.6.5/=b/libguile/.libs/lt-guile: error while 
> loading shared libraries: cannot open shared object file: 
> No such file or directory
> make[1]: *** [guile.texi] Error 1
> make[1]: Leaving directory `/home/bkorb/tools/guile/guile-1.6.5/=b/libguile'
> make: *** [install-recursive] Error 1

reply via email to

[Prev in Thread] Current Thread [Next in Thread]