[Top][All Lists]

[Date Prev][Date Next][Thread Prev][Thread Next][Date Index][Thread Index]

guile build failure - help !

From: Dave Nadler
Subject: guile build failure - help !
Date: Wed, 19 Nov 2008 18:01:34 -0500

Hi All - I'm trying to build guile under cygwin (GCC 3.4.4);
as I need it for autoconf (for some gcc work).
configure runs AOK at least I don't see anything wrong.
make runs for eons and then dies with the error below.
Many thanks in advance for any and all suggestions,
Best Regards, Dave

gcc -g -O2 -Wall -Wmissing-prototypes -Werror .libs/guile.exeS.o -o guile.exe guile-guile.o -Wl,--export-dynamic ./.libs/libguile.a -lgmp -lcrypt -lltdl
guile-guile.o: In function `main':
/cygdrive/d/home/drn/guile-1.8.5/libguile/guile.c:72: undefined reference to `_l
collect2: ld returned 1 exit status
rm -f .libs/guile.exeS.o
make[3]: *** [guile.exe] Error 1
make[3]: Leaving directory `/cygdrive/d/home/drn/guile-1.8.5/libguile'
make[2]: *** [all] Error 2
make[2]: Leaving directory `/cygdrive/d/home/drn/guile-1.8.5/libguile'
make[1]: *** [all-recursive] Error 1
make[1]: Leaving directory `/cygdrive/d/home/drn/guile-1.8.5'
make: *** [all] Error 2

Dave Nadler, USA East Coast voice (978) 263-0097, address@hidden

reply via email to

[Prev in Thread] Current Thread [Next in Thread]