[Top][All Lists]

[Date Prev][Date Next][Thread Prev][Thread Next][Date Index][Thread Index]

1.8 autobuild fails

From: Greg Troxel
Subject: 1.8 autobuild fails
Date: Sat, 09 May 2009 19:15:20 -0400
User-agent: Gnus/5.110011 (No Gnus v0.11) Emacs/22.3 (berkeley-unix)

This fails in test-round.c.  It's likely like "foo.h needs sys/types.h"
but I haven't looked yet - just wanted to point it out.

gcc -DHAVE_CONFIG_H -I. -I../..   -I/usr/pkg/include 
-I../../test-suite/standalone -I../.. -I../..  -I/usr/pkg/include -pthread -g 
-O2 -Wall -Wmissing-prototypes -Werror -MT test_round-test-round.o -MD -MP -MF 
.deps/test_round-test-round.Tpo -c -o test_round-test-round.o `test -f 
'test-round.c' || echo './'`test-round.c
In file included from test-round.c:30:
/usr/include/machine/fpu.h:14: error: expected specifier-qualifier-list before 
/usr/include/machine/fpu.h:30: error: expected specifier-qualifier-list before 
gmake[4]: *** [test_round-test-round.o] Error 1
gmake[4]: Leaving directory 

Attachment: pgpL6Vdood1Ag.pgp
Description: PGP signature

reply via email to

[Prev in Thread] Current Thread [Next in Thread]