[Top][All Lists]

[Date Prev][Date Next][Thread Prev][Thread Next][Date Index][Thread Index]

guile-cairo - make check fails

From: David Pirotte
Subject: guile-cairo - make check fails
Date: Sun, 14 Dec 2014 21:28:15 -0200


        debian testing
        guile (GNU Guile)

Sorry I never ran these checks before, just did (*) and here is a [funny] 
failure: guile's trying to
compile /bin/bash :) while make check in tests/unit-tests


(*) I'm facing a problem with guile-gnome, make distcheck fails on debian, 
no matter what, it wants to link to, which does not exists on 
so I thought I'll try make distcheck in guile-cairo and see if by any chance 
face and solve that problem 'here'... If you are interested and/or have an
idea for this guile-gnoe make distcheck problem, try to read the #guile log of 
[sunday the 14th, 2014], I tried a couple of things with the help of Ludovic, 
but so
far no success yet.

;; --

Making check in unit-tests
make[3]: Entering directory 
make  check-TESTS
make[4]: Entering directory 
make[5]: Entering directory 
;;; note: auto-compilation is enabled, set GUILE_AUTO_COMPILE=0
;;;       or pass the --no-auto-compile argument to disable.
;;; compiling /bin/bash
;;; WARNING: compilation of /bin/bash failed:
;;; ERROR: In procedure read_inner_expression: /bin/bash:7:14: unexpected ")"
In ice-9/boot-9.scm:
 157: 10 [catch #t #<catch-closure f5b9a0> ...]
In unknown file:
   ?: 9 [apply-smob/1 #<catch-closure f5b9a0>]
In ice-9/boot-9.scm:
  63: 8 [call-with-prompt prompt0 ...]
In ice-9/eval.scm:
 432: 7 [eval # #]
In ice-9/boot-9.scm:
2401: 6 [save-module-excursion #<procedure f83bc0 at ice-9/boot-9.scm:4045:3 
4050: 5 [#<procedure f83bc0 at ice-9/boot-9.scm:4045:3 ()>]
1724: 4 [%start-stack load-stack ...]
1729: 3 [#<procedure 12ee0f0 ()>]
In unknown file:
   ?: 2 [primitive-load "/bin/bash"]
In ice-9/eval.scm:
 393: 1 [eval # ()]
In unknown file:
   ?: 0 [memoize-variable-access! # #]

ERROR: In procedure memoize-variable-access!:
ERROR: Unbound variable: 
Makefile:655: recipe for target 'api-stability.scm.log' failed
make[5]: *** [api-stability.scm.log] Error 1
make[5]: Leaving directory 
Makefile:634: recipe for target 'check-TESTS' failed
make[4]: *** [check-TESTS] Error 2
make[4]: Leaving directory 
Makefile:714: recipe for target 'check-am' failed
make[3]: *** [check-am] Error 2
make[3]: Leaving directory 
Makefile:361: recipe for target 'check-recursive' failed
make[2]: *** [check-recursive] Error 1
make[2]: Leaving directory '/usr/local/src/guile-cairo/git-clone/tests'
Makefile:497: recipe for target 'check-recursive' failed
make[1]: *** [check-recursive] Error 1
make[1]: Leaving directory '/usr/local/src/guile-cairo/git-clone'
Makefile:789: recipe for target 'check' failed
make: *** [check] Error 2
address@hidden:/usr/local/src/guile-cairo/git-clone 60 $ 

Attachment: pgpX_dorAuqBv.pgp
Description: OpenPGP digital signature

reply via email to

[Prev in Thread] Current Thread [Next in Thread]