[Top][All Lists]

[Date Prev][Date Next][Thread Prev][Thread Next][Date Index][Thread Index]

Re: compilation error on Apple M1

From: Colin Woodbury
Subject: Re: compilation error on Apple M1
Date: Sun, 25 Dec 2022 21:45:34 -0800

A fix for M1 chips was recently added to the master branch. Can you try compiling that instead of 3.0.7?


2022/12/25 15:59、Damien Mattei <>のメール:

while trying to compile guile 3.0.7 on Apple M1...

On Mon, Dec 26, 2022 at 12:32 AM Damien Mattei <> wrote:

on Apple M1 i have this error:

/Applications/ note: expanded from macro '__deprecated_msg'
        #define __deprecated_msg(_msg) __attribute__((__deprecated__(_msg)))
1 warning generated.
  CC       libguile_3.0_la-net_db.lo
  CC       libguile_3.0_la-socket.lo
  CC       libguile_3.0_la-regex-posix.lo
Undefined symbols for architecture arm64:
  "_iconv", referenced from:
      _mem_cd_iconveh_internal in libgnu.a(striconveh.o)
     (maybe you meant: _str_iconveh, _mem_iconveh , _scm_port_acquire_iconv_descriptors , _iconveh_open , _iconveh_close , _mem_cd_iconveh , _str_cd_iconveh , _scm_port_release_iconv_descriptors )
  "_iconv_close", referenced from:
      _iconveh_open in libgnu.a(striconveh.o)
      _iconveh_close in libgnu.a(striconveh.o)
  "_iconv_open", referenced from:
      _iconveh_open in libgnu.a(striconveh.o)
ld: symbol(s) not found for architecture arm64
clang: error: linker command failed with exit code 1 (use -v to see invocation)
make[3]: *** [] Error 1
make[2]: *** [all] Error 2
make[1]: *** [all-recursive] Error 1
make: *** [all] Error 2

any idea about this arm64?


reply via email to

[Prev in Thread] Current Thread [Next in Thread]