[Top][All Lists]

[Date Prev][Date Next][Thread Prev][Thread Next][Date Index][Thread Index]

Error during installation

From: Law Chong Fatt
Subject: Error during installation
Date: Thu, 17 Apr 2003 15:34:34 +0800

I'm a new user to GNU softwares and a novice in the UNIX environment. It would 
be very much appreciated if someone could help me with this.
I'm trying to install GNU GUILE in my system. While executing "make", the 
following error messages were generated:
make[3]: *** [] Error 127
make[3]: Leaving directory `/home/cflaw/tools/guile-1.6.3/libguile-ltdl'
make[2]: *** [all-recursive] Error 1
make[2]: Leaving directory `/home/cflaw/tools/guile-1.6.3/libguile-ltdl'
make[1]: *** [all-recursive] Error 1
make[1]: Leaving directory `/home/cflaw/tools/guile-1.6.3'
make: *** [all] Error 2
Could someone tell me what needs to be done?

reply via email to

[Prev in Thread] Current Thread [Next in Thread]