[Top][All Lists]

[Date Prev][Date Next][Thread Prev][Thread Next][Date Index][Thread Index]

make check test failures v2.0.1 - Darwin OS X 10.6.7

From: Graham Reitz
Subject: make check test failures v2.0.1 - Darwin OS X 10.6.7
Date: Sat, 11 Jun 2011 10:55:49 -0500

The intent is to build guile in order to test (make check) a gcc build.  It's 
one of the dependencies.

After running guile 2.0.1 make check a number of unexpected errors occurred.   
Are these considered normal?


Attached are the make check and config logs.

Totals for this test run:
passes:                 34496
failures:               6
unexpected passes:      0
expected failures:      31
unresolved test cases:  30
untested test cases:    1
unsupported test cases: 9
errors:                 0

FAIL: check-guile
1 of 1 test failed
Please report to address@hidden
make[3]: *** [check-TESTS] Error 1
make[2]: *** [check-am] Error 2
make[1]: *** [check-recursive] Error 1
make: *** [check] Error 2
Golan-Trevize:guile-2.0.1 grahamreitz$ 

Attachment: check-guile.log
Description: Binary data

Attachment: config.log
Description: Binary data

reply via email to

[Prev in Thread] Current Thread [Next in Thread]