[Top][All Lists]

[Date Prev][Date Next][Thread Prev][Thread Next][Date Index][Thread Index]

can't build gnustep-base on cygwin

From: Paul Forgey
Subject: can't build gnustep-base on cygwin
Date: Sat, 2 Oct 2004 03:20:44 -0700

Running cygwin 1.5.11-1 and trying to build gnustep-base 1.10.0, I'm running into the following build error. It's failing because there is no occurance of "_class_name_" in the resulting list. What exactly is the build process attempting to do? I see _class_name_ in the nm output, but not if I filter it with the first grep statement. I do, however, see quite a few symbols starting with ___objc_class_name_ with a 'U' instead. Does this mean for some reason the definitions are never actually being built?

cat > libgnustep-base.def
nm [long list of objects] | grep '^........ [T] _' | sed 's/[^_]*_//' > _tmp.def
cat _tmp.def | grep "_class_name_" >> libgnustep-base.def
make[2]: *** [libgnustep-base.def] Error 1
make[1]: *** [libgnustep-base.all.library.variables] Error 2
make[1]: Leaving directory `/cygdrive/c/users/paulf/src/gnustep/gnustep-base-1.1
make: *** [internal-all] Error 2

reply via email to

[Prev in Thread] Current Thread [Next in Thread]