[Top][All Lists]

[Date Prev][Date Next][Thread Prev][Thread Next][Date Index][Thread Index]

Re: gorm compile error

From: Richard Frith-Macdonald
Subject: Re: gorm compile error
Date: Mon, 12 Oct 2009 20:05:20 +0100

On 12 Oct 2009, at 19:50, Michael Thaler wrote:


I am trying to compile gorm from svn and the the following compile error:

Making all for app Gorm...
Compiling file Gorm.m ...
Compiling file main.m ...
Linking app Gorm ...
GormCore/./obj/ undefined reference to `class_nextMethodList'
collect2: ld returned 1 exit status
make[2]: *** [] Error 1
make[1]: *** [internal-app-run-compile-submake] Error 2
make: *** [] Error 2

Does someone know what's wrong here? What do I have to do to fix this?

Update base and gorm from svn, rebuild both.

reply via email to

[Prev in Thread] Current Thread [Next in Thread]