[Top][All Lists]

[Date Prev][Date Next][Thread Prev][Thread Next][Date Index][Thread Index]

[Help-nano] Install Error

From: MikiStrange
Subject: [Help-nano] Install Error
Date: Mon, 15 Jan 2018 19:03:15 +0000

Hello Benno

I followed your instructions.
Everything seemed to be OK until the end of the installation and I saw this in the last few lines:

In file included from proto.h:24:0,
                 from browser.c:22:
nano.h:94:20: fatal error: curses.h: No such file or directory
compilation terminated.
Makefile:1568: recipe for target 'browser.o' failed
make[2]: *** [browser.o] Error 1
make[2]: Leaving directory '/home/miki/Downloads/nano/nano-2.9.2/src'
Makefile:1544: recipe for target 'all-recursive' failed
make[1]: *** [all-recursive] Error 1
make[1]: Leaving directory '/home/miki/Downloads/nano/nano-2.9.2'
Makefile:1483: recipe for target 'all' failed
make: *** [all] Error 2
Is that something I've done wrong or my computer?
I'm not sure.
Nano is still working OK but is still on version 2.5.3 so the installation has failed.
I'm not sure what to do now.
All the best.



reply via email to

[Prev in Thread] Current Thread [Next in Thread]