[Top][All Lists]

[Date Prev][Date Next][Thread Prev][Thread Next][Date Index][Thread Index]

Compile error

From: John E.Garrott Sr
Subject: Compile error
Date: Thu, 02 Mar 2000 19:13:29 -0800

Attempting to compile Octave under Slackware 7.0,
the following error message was received:

In file included from
/usr/include/termcap.h:37: invalid exception specifications
/usr/include/termcap.h:48: invalid exception specifications
make[2]: *** [sysdep.o] Error 1
make[2]: Leaving directory `/usr/src/octave-2.0.16/src'
make[1]: *** [src] Error 2
make[1]: Leaving directory `/usr/src/octave-2.0.16'
make: *** [all] Error 2

Lines 37 and 48 of /usr/include/termcap.h seem to be
valid statements.

I am using glibc-2.1.2 and egcs-2.91.66

Thanks for any help you can give,


Octave is freely available under the terms of the GNU GPL.

Octave's home on the web:
How to fund new projects:
Subscription information:

reply via email to

[Prev in Thread] Current Thread [Next in Thread]