[Top][All Lists]

[Date Prev][Date Next][Thread Prev][Thread Next][Date Index][Thread Index]

problem exits in installing the Octave in sun-solaris2.6.

From: Rone Shu
Subject: problem exits in installing the Octave in sun-solaris2.6.
Date: Fri, 21 Sep 2001 14:49:09 -0500

Dear Sir/Mam,

       I meet some problem while I compiling the Octave 2.0.16 in sun-solaries2.6.


Follow is the error message!


make[2]: Entering directory `/users/rshu/octave-2.0.16/liboctave'

make[2]: *** Warning: File `dbleSVD.d' has modification time in the future (2001-09-21 14:43:49.940036 > 2001-09-21 14:36:55.774000962)

c++ -c  -I. -I.. -I../liboctave -I../src -I../libcruft/misc  -I../glob -I../glob -DHAVE_CONFIG_H -fno-rtti -fno-exceptions -fno-implicit-templates -g -O2 -Wall

In file included from mx-defs.h:72,

                 from dColVector.h:32,

                 from Bounds.h:32,


oct-cmplx.h:28: syntax error before `;' token

In file included from dColVector.h:32,

                 from Bounds.h:32,


mx-defs.h:81: parse error before `&' token

mx-defs.h:82: `c_c_Mapper' was not declared in this scope

mx-defs.h:82: parse error before `&' token

mx-defs.h:82: ISO C++ forbids declaration of `Complex' with no type

mx-defs.h:82: typedef declaration includes an initializer

mx-defs.h:82: confused by earlier errors, bailing out

make[2]: *** [Bounds.o] Error 1

make[2]: Leaving directory `/users/rshu/octave-2.0.16/liboctave'

make[1]: *** [liboctave] Error 2

make[1]: Leaving directory `/users/rshu/octave-2.0.16'

make: *** [all] Error 2


I have successfully installed the GNU make, GCC, GNU Plot before I tried to compile the Octave 2.0.16


Thank you for kindly help!


Dr. Rone Shu, Software Engineer

Rock Solid Images

2600 S. Gessner, Suite 650

Houston, Texas 77063

Ph. 713-783-5593, Fx. 713-783-5594


reply via email to

[Prev in Thread] Current Thread [Next in Thread]