[Top][All Lists]

[Date Prev][Date Next][Thread Prev][Thread Next][Date Index][Thread Index]

[Help-smalltalk] failed build attempt

From: Brad Watson
Subject: [Help-smalltalk] failed build attempt
Date: Thu, 28 Dec 2006 09:15:08 -0800 (PST)

I pulled the lastest cvs updated, attempted to re-build, and encountered the 

echo timestamp > ./kernel/stamp-classes
SMALLTALK_KERNEL="`cd ./kernel; pwd`" \
        SMALLTALK_IMAGE="`pwd`" \
          ./gst -iQ /dev/null
a Smalltalk string:1: undefined variable VMpr_Behavior_methodsFor referenced
/home/whitebearded1/src/smalltalk/kernel/ Aborted
/home/whitebearded1/src/smalltalk/kernel/ Error occurred while 
not in byte code inter preter!!
make[2]: *** [] Aborted
make[2]: Leaving directory `/home/whitebearded1/src/smalltalk'
make[1]: *** [all-recursive] Error 1
make[1]: Leaving directory `/home/whitebearded1/src/smalltalk'
make: *** [all] Error 2

Do You Yahoo!?
Tired of spam?  Yahoo! Mail has the best spam protection around

reply via email to

[Prev in Thread] Current Thread [Next in Thread]