[Top][All Lists]

[Date Prev][Date Next][Thread Prev][Thread Next][Date Index][Thread Index]

error while instalation

From: Dipesh
Subject: error while instalation
Date: Tue, 5 Jul 2005 10:01:37 +0530


I am very new to this field.

I have downloaded the snacc 1.3 compiler. But now able to install it.

Its giving error.

The error is as follows.


make[3]: *** [Cebuf] Error 1

make[3]: Leaving directory `/home/snacc-1.3/c-lib'

make[2]: *** [Cebuf-lib] Error 2

make[2]: Leaving directory `/home/snacc-1.3/c-lib'

make[1]: *** [../c-lib/libasn1cCebuf.a] Error 2

make[1]: Leaving directory `/home/snacc-1.3/compiler'

make: *** [compiler] Error 2




Mediation Engineer.

Nt5 Software Solutions India Pvt. Ltd. Logo Software Solutions (India) Pvt Ltd
(A subsidiary of Neural Technologies Ltd, UK)
Bangalore, India
Phone : +91 80 5115 4223





Any views expressed in this message are those of the individual sender, except where the sender specifically states them to be the views of Neural Technologies Limited.

This email contains information that is confidential and is for the exclusive use of the addressee. If you are not the addressee, please note that any distribution, dissemination, copying or use of this communication or the information contained in it is prohibited.


reply via email to

[Prev in Thread] Current Thread [Next in Thread]