[Top][All Lists]

[Date Prev][Date Next][Thread Prev][Thread Next][Date Index][Thread Index]

CVS puzzle

From: David Bobroff
Subject: CVS puzzle
Date: Tue, 13 Dec 2005 06:38:36 +0000

After updating (using pserver rather than anoncvs) I've had strange
output from the console.  I even tried trashing my LilyPond src tree and
doing a fresh checkout and still I get puzzling output.

Here are the first few lines after doing ./

address@hidden lilypond]# ./
stepmake/aclocal.m4 is newer.  Copying file.
processing .
Running autoconf ... warning: AC_CANONICAL_HOST invoked multiple times
autoconf/specific.m4:363: AC_CYGWIN is expanded from...
aclocal.m4:1274: STEPMAKE_WINDOWS is expanded from... the top level
autoconf/specific.m4:393: AC_MINGW32 is expanded from...
    Warning: about to run `configure' without arguments.
    arguments on the `./' command line
    will be passed to `configure'.

    Invoke with --noconfigure to skip configure step.
Running ./configure ...

After getting this doing 'make all' would exit with a few lines of
output mentioning something about 'too many files open'.  I would have
included exactly what it had output but this time it appeared to
compile.  Then 'make install' chugged along just fine, too.

But when I did 'make web' it exited like this:

Renaming input to: `'
Interpreting music... [4]
Preprocessing graphical objects...
Calculating line breaks... [3][4]
Writing header field `texidoc' to `lily-153969342.texidoc'...
Writing header field `texidoc' to `lily-153969342.texidoc'...
Writing lily-153969342-systems.tex...
Writing lily-153969342-systems.texi...
Layout output to `lily-153969342-1.eps'...
Layout output to `lily-153969342.eps'...
Converting to PNG...
Processing `out-www/collated-files.tely:621 ('
Renaming input to: `'
Interpreting music... warning: `lilypond' failed
(signal 11) ( ignored) error: Process /usr/src/lilypond/lily/out/lilypond --
backend=e ps --formats=ps,png --header=texidoc -
I /usr/src/lilypond/input/test -dinternal- type-checking -danti-alias-
factor=2 -dgs-font-load -I  '/usr/src/lilypond/input/ test'  -I
'/usr/src/lilypond/input/test'  -I  '/usr/src/lilypond/input/test/out -
www'  -I  '/usr/src/lilypond/input'  -I
'/usr/src/lilypond/input/regression' -I  '/usr/src/lilypond/input/test'
-I  '/usr/src/lilypond/input/tutorial'  -I '/usr/src/lilypond/mf/out'  -
I  '/usr/src/lilypond/mf/out' lily-1 563207118
lily-958258976 lily-2083556259 lily-86632044 lily-117452165 lily-17164
42047 lily-1619305460 lily-868884573 lily-815678250 lily-1829375645
lily-1854185 821 lily-1346477414 lily-653968934 lily-1258847882
lily-406268608 lily-949282084  lily-1493859482 lily-671873400
lily-1048420762 lily-1172526311 lily-2122655435 lily-1820952482
lily-1396548022 lily-254273985 lily-1171495244 lily-443108049 li
ly-1019422860 lily-1035476625 lily-1849054820 lily-881289079
lily-1831563529 lil y-546915777 lily-1973475713 lily-344589519
lily-1749950541 lily-1679427266 lily- 1060349588 lily-553211413
lily-476188919 lily-296479222 lily-444718703 lily-9874 32688
lily-274081501 lily-199971838 lily-1855008033 lily-1576890297
lily-5052871 17 lily-346114291 lily-302530777 lily-978397998
lily-1765285549 lily-823696877 l ily-518749076 lily-1771902508
lily-1833831990 lily-1674416829 lily-343764970 lil y-1055029085
lily-940499120 lily-1225327039 lily-339899610 lily-1582817935 lily-
456404653 lily-1709207246 lily-1611292188 lily-153969342 lily-2059992443
lily-72 8542717 lily-2068773734 lily-1105001930 exited unsuccessfully.
Removing `collated-files.texi'
Traceback (most recent call last):
  File "../../scripts/", line 1692, in ?
    main ()
  File "../../scripts/", line 1675, in main
    ly.exit (1)
  File "/usr/src/lilypond/out/share/lilypond/2.7.23/python/",
line 86,  in exit
    raise _ ('Exiting (%d)...') % i
Exiting (1)...
make[3]: *** [out-www/collated-files.texi] Error 1
make[3]: Leaving directory `/usr/src/lilypond/input/test'
make[2]: *** [WWW] Error 2
rm out-www/ out-www/ out-www/les- o ut-www/ out-www/
make[2]: Leaving directory `/usr/src/lilypond/input'
make[1]: *** [WWW] Error 2
make[1]: Leaving directory `/usr/src/lilypond'
make: *** [web] Error 2
address@hidden lilypond]#

This is with CVS ChangeLog 1.4343 on Fedora Core 3.


reply via email to

[Prev in Thread] Current Thread [Next in Thread]