[Top][All Lists]

[Date Prev][Date Next][Thread Prev][Thread Next][Date Index][Thread Index]

Install error: missing

From: Colin Campbell
Subject: Install error: missing
Date: Sun, 5 Apr 2020 13:21:59 -0600
User-agent: Mozilla/5.0 (X11; Linux x86_64; rv:68.0) Gecko/20100101 Thunderbird/68.6.0

Pulled from master this morning. Compiled without apparent error. Install choked as below. Deleted /build, re-ran, mkdir build, cd build, ../configure and re-compiled, again without apparent error.


colin@Sherlock build]$ sudo make install
[sudo] password for colin:
Traceback (most recent call last):
  File "/home/colin/lilypond-git/build/scripts/build/out/install", line 77, in <module>
    shutil.copy2 (f, dest)
  File "/usr/lib64/python3.7/", line 266, in copy2
    copyfile(src, dst, follow_symlinks=follow_symlinks)
  File "/usr/lib64/python3.7/", line 120, in copyfile
    with open(src, 'rb') as fsrc:
FileNotFoundError: [Errno 2] No such file or directory: ''
make[1]: *** [/home/colin/lilypond-git/build/../stepmake/stepmake/install-out-targets.make:9: local-install-outfiles] Error 1 make: *** [/home/colin/lilypond-git/build/../stepmake/stepmake/toplevel-targets.make:27: install] Error 2


Curiously, appears in several locations on my machine:


colin@Sherlock build]$ locate

ISTM I compiled a week or so ago without error, so I'm open to guidance from the collected wisdom.



There is nothing so useless as doing efficiently that which should not be done at all.
- Peter F. Drucker, 1909 - 2005

reply via email to

[Prev in Thread] Current Thread [Next in Thread]