[Top][All Lists]

[Date Prev][Date Next][Thread Prev][Thread Next][Date Index][Thread Index]

error building LilyPond 2.23.7 in Frescobaldi flatpak

From: Federico Bruni
Subject: error building LilyPond 2.23.7 in Frescobaldi flatpak
Date: Wed, 30 Mar 2022 23:51:13 +0200

Hi folks

Can anybody help me with the following error?

Making lily/out/lexer.o < cc
Making lily/out/parser.o < cc
Making lily/out/lilypond
/usr/lib/gcc/x86_64-unknown-linux-gnu/10.2.0/../../../../x86_64-unknown-linux-gnu/bin/ld: warning: ./out/ly-module.o has a corrupt string table index - ignoring /usr/lib/gcc/x86_64-unknown-linux-gnu/10.2.0/../../../../x86_64-unknown-linux-gnu/bin/ld: error: ./out/ly-module.o: ELF section name out of range
collect2: error: ld returned 1 exit status
make[1]: *** [GNUmakefile:40: out/lilypond] Error 1
make: *** [/run/build/lilypond-dev/stepmake/stepmake/generic-targets.make:6: all] Error 2
Error: module lilypond-dev: Child process exited with code 2

See also the attached full log.

This is the GCC version:

[📦 org.kde.Sdk ~]$ gcc --version
gcc (GCC) 10.2.0

I'm using this flatpak manifest:


Attachment: lilypond-dev-build-error.txt
Description: Text document

reply via email to

[Prev in Thread] Current Thread [Next in Thread]