[Top][All Lists]

[Date Prev][Date Next][Thread Prev][Thread Next][Date Index][Thread Index]

Error compiling - SuSE 8.2/Lily 1.7.20

From: Hans Forbrich
Subject: Error compiling - SuSE 8.2/Lily 1.7.20
Date: Fri, 30 May 2003 13:06:23 -0600

Just getting around to installing Lilypond 1.7 on my new SuSE 8.2
environment.  I've encountered the error listed.  SuSE 8.2 has extremely
recent dev tools which may cause the problems.

I've been upgrading the various tools described on the Lilypond
development build site to try to resolve this (and currently upgrading
gcc to the production release).  In the list below, where I indicate
upgraded, I've tried to build Lilypond using both.

gcc version 3.3 20030226 (prerelease) (supplied by SuSE)
python 2.2.2                            (supplied by SuSE)
bison (GNU Bison) 1.75          (supplied by SuSE)
bison (GNU Bison) 1.875a      (upgrade)
guile 1.6.2                                (supplied by SuSE)
make 3.80                               (supplied by SuSE)
flex 2.5.4                                 (supplied by SuSE)
flex 2.5.4a                               (upgrade)

Advice appreciated.

make[1]: Entering directory
rm -f ./out/getopt-long.dep; DEPENDENCIES_OUTPUT="./out/getopt-long.dep
./out/getopt-long.o" g++ -c   -DHAVE_CONFIG_H  -DSTRING_UTILS_INLINED
-Iinclude -I./out -I../flower/include -I../flower/./out -O2
-finline-functions -g        -O2 -finline-functions -g    -Wall  -W
-Wmissing-prototypes -Wconversion  -o out/getopt-long.o error: parse error before `const' In function `char* dcgettext(...)': error: `s' undeclared (first use this function) error: (Each undeclared identifier is reported only
for    each function it appears in.)
make[1]: *** [out/getopt-long.o] Error 1
make[1]: Leaving directory
make: *** [all] Error 2

reply via email to

[Prev in Thread] Current Thread [Next in Thread]