[Top][All Lists]

[Date Prev][Date Next][Thread Prev][Thread Next][Date Index][Thread Index]

[Octave-bug-tracker] [bug #37050] JIT build fails

From: Michael Godfrey
Subject: [Octave-bug-tracker] [bug #37050] JIT build fails
Date: Tue, 07 Aug 2012 18:05:57 +0000
User-agent: Mozilla/5.0 (Macintosh; Intel Mac OS X 10.6; rv:14.0) Gecko/20100101 Firefox/14.0.1


                 Summary: JIT build fails
                 Project: GNU Octave
            Submitted by: godfrey
            Submitted on: Tue 07 Aug 2012 06:05:57 PM GMT
                Category: Interpreter
                Severity: 3 - Normal
                Priority: 5 - Normal
              Item Group: Build Failure
                  Status: None
             Assigned to: None
         Originator Name: godfrey
        Originator Email: 
             Open/Closed: Open
         Discussion Lock: Any
                 Release: dev
        Operating System: GNU/Linux



Fails at:

interp-core/jit-typeinfo.cc: In member function 'void
interp-core/jit-typeinfo.cc:2065:75: error: invalid conversion from 'const
llvm::Type*' to 'llvm::Type*' [-fpermissive]
interp-core/jit-typeinfo.cc:1802:1: error:   initializing argument 3 of
'jit_type* jit_typeinfo::new_type(const string&, jit_type*, llvm::Type*)'
make[3]: *** [interp-core/jit-typeinfo.lo] Error 1
make[3]: Leaving directory `/home/godfrey/octave/hg/octave/src'
make[2]: *** [all] Error 2
make[2]: Leaving directory `/home/godfrey/octave/hg/octave/src'
make[1]: *** [all-recursive] Error 1
make[1]: Leaving directory `/home/godfrey/octave/hg/octave'
make: *** [all] Error 2

System is Fedora 16 x86_64
Build without JIT completes OK.


Reply to this item at:


  Message sent via/by Savannah

reply via email to

[Prev in Thread] Current Thread [Next in Thread]