[Top][All Lists]

[Date Prev][Date Next][Thread Prev][Thread Next][Date Index][Thread Index]

[Octave-bug-tracker] [bug #41578] pkg fits install fails

From: anonymous
Subject: [Octave-bug-tracker] [bug #41578] pkg fits install fails
Date: Thu, 13 Feb 2014 14:48:27 +0000
User-agent: Mozilla/5.0 (Macintosh; Intel Mac OS X 10_9_1) AppleWebKit/537.73.11 (KHTML, like Gecko) Version/7.0.1 Safari/537.73.11


                 Summary: pkg fits install fails
                 Project: GNU Octave
            Submitted by: None
            Submitted on: jeu. 13 févr. 2014 14:48:26 UTC
                Category: Octave Forge Package
                Severity: 3 - Normal
                Priority: 5 - Normal
              Item Group: Regression
                  Status: None
             Assigned to: None
         Originator Name: DD
        Originator Email: 
             Open/Closed: Open
         Discussion Lock: Any
                 Release: 3.8.0
        Operating System: Mac OS



pkg install -forge fits
read_fits_image.cc:142:5: error: no template named 'MArrayN'; did you mean
    MArrayN<double> image_data( dims ); // a octave double-type array
note: 'MArray' declared here
MArray : public Array<T>
1 error generated.
make: *** [read_fits_image.oct] Error 1
mkoctfile --verbose -Wall -L/usr/local/Cellar/cfitsio/3.360/lib -lcfitsio 
clang++ -c -fPIC
-I/usr/local/Cellar/octave/3.8.0/include -D_REENTRANT -D_THREAD_SAFE -pthread
-Wall read_fits_image.cc -o read_fits_image.o

pkg: error running `make' for the fits package.
error: called from 'configure_make' in file
near line 82, column 9
error: called from:
/usr/local/Cellar/octave/3.8.0/share/octave/3.8.0/m/pkg/private/install.m at
line 199, column 5
error:   /usr/local/Cellar/octave/3.8.0/share/octave/3.8.0/m/pkg/pkg.m at line
394, column 9


Reply to this item at:


  Message posté via/par Savannah

reply via email to

[Prev in Thread] Current Thread [Next in Thread]