[Top][All Lists]

[Date Prev][Date Next][Thread Prev][Thread Next][Date Index][Thread Index]

[Octave-bug-tracker] [bug #44075] buid mxe-octave fails "Failed to build

From: Avinoam Kalma
Subject: [Octave-bug-tracker] [bug #44075] buid mxe-octave fails "Failed to build package nsis"
Date: Sat, 24 Jan 2015 08:20:19 +0000
User-agent: Mozilla/5.0 (Windows NT 6.1; WOW64) AppleWebKit/537.36 (KHTML, like Gecko) Chrome/39.0.2171.99 Safari/537.36


                 Summary: buid mxe-octave fails "Failed to build package nsis"
                 Project: GNU Octave
            Submitted by: avinoam
            Submitted on: Sat 24 Jan 2015 08:20:18 AM GMT
                Category: Configuration and Build System
                Severity: 3 - Normal
                Priority: 5 - Normal
              Item Group: Build Failure
                  Status: None
             Assigned to: None
         Originator Name: Avinoam
        Originator Email: 
             Open/Closed: Open
         Discussion Lock: Any
                 Release: dev
        Operating System: GNU/Linux



building mxe-octave on Ubuntu I get "Failed to build package nsis"

last lines of log file:

i686-w64-mingw32-g++ -o build/release/stub_bzip2/stub_bzip2.exe -s -mwindows
-nostdlib -Wl,--exclude-libs,msvcrt.a -Wl,--file-alignment,512
-Wl,-e,address@hidden -Wl,-Map,build/release/stub_bzip2/stub_bzip2.map -T
SCons/Config/linker_script build/release/stub_bzip2/bgbg.o
build/release/stub_bzip2/components.o build/release/stub_bzip2/exec.o
build/release/stub_bzip2/fileform.o build/release/stub_bzip2/Main.o
build/release/stub_bzip2/plugin.o build/release/stub_bzip2/Ui.o
build/release/stub_bzip2/util.o build/release/stub_bzip2/crc32.o
build/release/stub_bzip2/bzlib.o build/release/stub_bzip2/decompress.o
build/release/stub_bzip2/huffman.o build/release/stub_bzip2/resource.o
-L/usr/local/lib -lkernel32 -luser32 -lgdi32 -lshell32 -ladvapi32 -lcomdlg32
-lcomctl32 -lole32 -lversion -luuid
ertr000001.o:(.rdata+0x0): undefined reference to `_pei386_runtime_relocator'
collect2: error: ld returned 1 exit status
scons: *** [build/release/stub_bzip2/stub_bzip2.exe] Error 1
scons: building terminated because of errors.
make[1]: *** [build-only-nsis] Error 2

full nsis log attached.


File Attachments:

Date: Sat 24 Jan 2015 08:20:18 AM GMT  Name: nsis.log  Size: 25kB   By:



Reply to this item at:


  Message sent via/by Savannah

reply via email to

[Prev in Thread] Current Thread [Next in Thread]