[Top][All Lists]

[Date Prev][Date Next][Thread Prev][Thread Next][Date Index][Thread Index]

[Octave-bug-tracker] [bug #53736] Missing test for libsuitesparseconfig

From: Adrian
Subject: [Octave-bug-tracker] [bug #53736] Missing test for libsuitesparseconfig in configure script
Date: Tue, 24 Apr 2018 07:40:10 -0400 (EDT)
User-agent: Mozilla/5.0 (X11; Linux x86_64; rv:52.0) Gecko/20100101 Firefox/52.0


                 Summary: Missing test for libsuitesparseconfig in configure
                 Project: GNU Octave
            Submitted by: adaerr
            Submitted on: Tue 24 Apr 2018 11:40:08 AM UTC
                Category: Configuration and Build System
                Severity: 3 - Normal
                Priority: 5 - Normal
              Item Group: Build Failure
                  Status: None
             Assigned to: None
         Originator Name: 
        Originator Email: 
             Open/Closed: Open
         Discussion Lock: Any
                 Release: dev
        Operating System: GNU/Linux



Compiling current hg tip 25294:01ad54f997f5 fails with

/usr/bin/x86_64-linux-gnu-ld: cannot find -lsuitesparseconfig
collect2: error: ld returned 1 exit status
Makefile:13275: recipe for target 'liboctave/liboctave.la' failed
make[2]: *** [liboctave/liboctave.la] Error 1
Makefile:10172: recipe for target 'all' failed
make: *** [all] Error 2

This is a minor problem and trivial to fix (installing package
libsuitesparse-dev in Debian GNU/Linux for example), but it may be nice to
catch this at bootstrapping time.


Reply to this item at:


  Message sent via/by Savannah

reply via email to

[Prev in Thread] Current Thread [Next in Thread]