[Top][All Lists]

[Date Prev][Date Next][Thread Prev][Thread Next][Date Index][Thread Index]

[Octave-bug-tracker] [bug #55234] compile error in libgui/src/documentat

From: A.R. Burgers
Subject: [Octave-bug-tracker] [bug #55234] compile error in libgui/src/documentation.cc
Date: Sun, 16 Dec 2018 14:40:49 -0500 (EST)
User-agent: Mozilla/5.0 (Windows NT 10.0; Win64; x64) AppleWebKit/537.36 (KHTML, like Gecko) Chrome/58.0.3029.110 Safari/537.36 Edge/16.16299


                 Summary: compile error in libgui/src/documentation.cc
                 Project: GNU Octave
            Submitted by: arb
            Submitted on: Sun 16 Dec 2018 07:40:48 PM UTC
                Category: GUI
                Severity: 3 - Normal
                Priority: 5 - Normal
              Item Group: Build Failure
                  Status: None
             Assigned to: None
         Originator Name: 
        Originator Email: 
             Open/Closed: Open
         Discussion Lock: Any
                 Release: dev
        Operating System: GNU/Linux



a build failure in recent dev and Qt 5.4:

  CXX      libgui/src/libgui_src_libgui_src_la-documentation.lo
../octave/libgui/src/documentation.cc: In member function 'void
../octave/libgui/src/documentation.cc:399:51: error: no match for call to
'(QStringList) ()'
       m_query_string = queries.first ().wordList ().first ();
make[2]: *** [libgui/src/libgui_src_libgui_src_la-documentation.lo] Error 1
make[2]: Leaving directory `/scratch/aburgers/octave/x86_64'
make[1]: *** [all-recursive] Error 1
make[1]: Leaving directory `/scratch/aburgers/octave/x86_64'
make: *** [all] Error 2

cat HG-ID


Reply to this item at:


  Message sent via Savannah

reply via email to

[Prev in Thread] Current Thread [Next in Thread]