[Top][All Lists]

[Date Prev][Date Next][Thread Prev][Thread Next][Date Index][Thread Index]

[Octave-bug-tracker] [bug #55646] image package 2.10.0 install fails on

From: Nicholas Jankowski
Subject: [Octave-bug-tracker] [bug #55646] image package 2.10.0 install fails on Windows (octave v4.4.1 and later)
Date: Tue, 5 Feb 2019 10:42:15 -0500 (EST)
User-agent: Mozilla/5.0 (Windows NT 10.0; Win64; x64) AppleWebKit/537.36 (KHTML, like Gecko) Chrome/58.0.3029.110 Safari/537.36 Edge/16.16299


                 Summary: image package 2.10.0 install fails on Windows
(octave v4.4.1 and later)
                 Project: GNU Octave
            Submitted by: nrjank
            Submitted on: Tue 05 Feb 2019 03:42:13 PM UTC
                Category: Octave Forge Package
                Severity: 3 - Normal
                Priority: 5 - Normal
              Item Group: Installation Failure
                  Status: None
             Assigned to: None
         Originator Name: Nicholas Jankowski
        Originator Email: 
             Open/Closed: Open
         Discussion Lock: Any
                 Release: 5.0.91
        Operating System: Microsoft Windows



noticed on 4.4.1 and just verified it also occurs on the current 5.0.91 (RC2):
 attempting to install or update the image package on windows results in an
install/build failure. I know there are some packages that cannot be
compiled/installed from the Windows build, but thought image was usually okay.
(using the Windows zip archive binaries)

>> pkg install -forge image
configure: error: in
configure: error: cannot run C++ compiled programs.
If you meant to cross compile, use `--host'.
See `config.log' for more details
configure: loading site script /usr/local/etc/config.site
checking for a sed that does not truncate output... /usr/bin/sed
checking for octave...
checking for mkoctfile...
checking whether the C++ compiler works... yes
checking for C++ compiler default output file name... a.exe
checking for suffix of executables... .exe
checking whether we are cross compiling...
pkg: error running the configure script for image.
error: called from
    configure_make at line 82 column 9
    install at line 184 column 7
    pkg at line 441 column 9


Reply to this item at:


  Message sent via Savannah

reply via email to

[Prev in Thread] Current Thread [Next in Thread]