[Top][All Lists]

[Date Prev][Date Next][Thread Prev][Thread Next][Date Index][Thread Index]

[Octave-bug-tracker] [bug #57801] Make fails for the documentation in De

From: Lars Kindermann
Subject: [Octave-bug-tracker] [bug #57801] Make fails for the documentation in Debian 10 testing (bullseye)
Date: Wed, 12 Feb 2020 17:56:27 -0500 (EST)
User-agent: Mozilla/5.0 (X11; Linux x86_64; rv:68.0) Gecko/20100101 Firefox/68.0


                 Summary: Make fails for the documentation in Debian 10
testing (bullseye)
                 Project: GNU Octave
            Submitted by: larskindermann
            Submitted on: Wed 12 Feb 2020 10:56:26 PM UTC
                Category: Configuration and Build System
                Severity: 3 - Normal
                Priority: 5 - Normal
              Item Group: Installation Failure
                  Status: None
             Assigned to: None
         Originator Name: 
        Originator Email: 
             Open/Closed: Open
                 Release: dev
         Discussion Lock: Any
        Operating System: GNU/Linux



I just installed Debian 10 (bullseye), the current testing and tried to buiuld
I am able to compile current dev binaries successfully, using this

sudo apt-get install gcc g++ gfortran make libblas-dev liblapack-dev
libpcre3-dev libarpack2-dev libcurl4-gnutls-dev epstool libfftw3-dev fig2dev
libfltk1.3-dev libfontconfig1-dev libfreetype6-dev libgl2ps-dev libglpk-dev
libreadline-dev gnuplot libgraphicsmagick++1-dev libhdf5-dev openjdk-13-jdk
libsndfile1-dev llvm-dev texinfo libgl1-mesa-dev libosmesa6-dev pstoedit
portaudio19-dev libjack-jackd2-dev libqhull-dev libqrupdate-dev libqt5core5a
qtbase5-dev qttools5-dev qttools5-dev-tools
libqscintilla2-qt5-dev libsuitesparse-dev texlive libxft-dev zlib1g-dev
autoconf automake bison flex gperf gzip icoutils librsvg2-bin libtool perl
rsync tar libsundials-dev git mercurial

However, make later fails while building the docs:

  MAKEINFO ../doc/interpreter/octave.info
  TEXI2DVI doc/interpreter/octave.dvi
  MAKEINFO doc/interpreter/octave.html/.octave-html-stamp
/usr/bin/texi2dvi: etex exited with bad status, quitting.
make[2]: *** [Makefile:31069: doc/interpreter/octave.dvi] Fehler 1
make[2]: *** Es wird auf noch nicht beendete Prozesse gewartet....
make[2]: Verzeichnis „/home/kinder/usr/octave-default/BUILD“ wird
make[1]: *** [Makefile:27399: all-recursive] Fehler 1
make[1]: Verzeichnis „/home/kinder/usr/octave-default/BUILD“ wird
make: *** [Makefile:11034: all] Fehler 2

Debian testing currently contains Octave 5.1.0.
I think it is neccessary to be in Debian testing to be included in the next
Ubuntu LTS


Reply to this item at:


  Message sent via Savannah

reply via email to

[Prev in Thread] Current Thread [Next in Thread]