[Top][All Lists]

[Date Prev][Date Next][Thread Prev][Thread Next][Date Index][Thread Index]


From: Doug Stewart
Subject: texi2pdf
Date: Sat, 8 Aug 2015 13:52:57 -0400

I get this error while trying to build the docs for stable from today.

Making all in interpreter
make[3]: Entering directory `/home/doug/octavecc1/octavess1/doc/interpreter'
  TEXI2PDF octave.pdf
/usr/bin/texi2dvi: pdfetex exited with bad status, quitting.
make[3]: *** [octave.pdf] Error 1
make[3]: Leaving directory `/home/doug/octavecc1/octavess1/doc/interpreter'
make[2]: *** [all-recursive] Error 1
make[2]: Leaving directory `/home/doug/octavecc1/octavess1/doc'
make[1]: *** [all-recursive] Error 1
make[1]: Leaving directory `/home/doug/octavecc1/octavess1'
make: *** [all] Error 2

Any  ideas as to what is wrong?


DASCertificate for 206392

reply via email to

[Prev in Thread] Current Thread [Next in Thread]