[Top][All Lists]

[Date Prev][Date Next][Thread Prev][Thread Next][Date Index][Thread Index]

[Pan-devel] CVS archive XS problem and compile problem, possibly relate

From: Bas Mevissen
Subject: [Pan-devel] CVS archive XS problem and compile problem, possibly related...
Date: Wed, 12 Mar 2003 13:13:24 +0100
User-agent: KMail/1.4.3

I've a problem with compiling a recent Pan from CVS and problems with XS to 
the anoncvs servers (XS denied, user anonymous unknown etc, but sometimes it 
works). I guess this is due a CVS sync problem at, but I think I 
better report it.

Here is the result from a compilation attempt (using a clean tree from CVS, as 
I always copy the CVS files to a "build tree"):

make[3]: Entering directory `/home/sgm/cvs/pan-devel/tests'
source='test-article.c' object='test-article.o' libtool=no \
depfile='.deps/test-article.Po' tmpdepfile='.deps/test-article.TPo' \
depmode=gcc3 /bin/sh ../depcomp \
gcc -DHAVE_CONFIG_H -I. -I. -I.. -I.. -D_REENTRANT -I/usr/include/glib-2.0 
r/lib/glib-2.0/include       -g -O2 -I/usr/include/glib-1.2 
ude -D_REENTRANT -I/usr/include/gnet -I/usr/lib/gnet/include -I. -c `test -f 
st-article.c' || echo './'`test-article.c
test-article.c: In function `pan_init':
test-article.c:27: too few arguments to function `base_prefs_init'
make[3]: *** [test-article.o] Error 1
make[3]: Leaving directory `/home/sgm/cvs/pan-devel/tests'
make[2]: *** [all-recursive] Error 1
make[2]: Leaving directory `/home/sgm/cvs/pan-devel/tests'
make[1]: *** [all-recursive] Error 1
make[1]: Leaving directory `/home/sgm/cvs/pan-devel'
make: *** [all] Error 2

Just in case this cannot be solved in a few days: Is it OK to supply patches 
against 0.13.90 instead of the latest CVS?



reply via email to

[Prev in Thread] Current Thread [Next in Thread]