[Top][All Lists]

[Date Prev][Date Next][Thread Prev][Thread Next][Date Index][Thread Index]

[paparazzi-builds] [paparazzi] Failed: stm32-cpp build #1

From: Semaphore
Subject: [paparazzi-builds] [paparazzi] Failed: stm32-cpp build #1
Date: Wed, 09 Mar 2016 18:58:55 +0000

Build 1 Failed for project paparazzi on branch stm32-cpp
Last commit for this build
Felix Ruess 09 Mar 18:53
c5fde68 — [stm32] also compile C++ files
Build Results
Thread 1
sudo add-apt-repository ppa:paparazzi-uav/ppa -y 00:02
sudo apt-get update -q 00:21
sudo apt-get install -y paparazzi-dev paparazzi-jsbsim gcc-arm-none-eabi gcc-arm-linux-gnueabihf libipc-run-perl 03:12
git submodule sync 00:00
if [ "$SEMAPHORE_TRIGGER_SOURCE" = "scheduler" ]; then make test_all_confs ; else make test ; fi 00:09
( Showing only the last 30 out of 252 lines. For a complete log visit the build page )

  CC      rtc.c
  CC      timer.c
  CC      mac.c
  CC      mac_stm32fxx7.c
  CC      phy.c
  CC      phy_ksz8051mll.c
  CC      crc_common_all.c
  CC      dac_common_all.c
  CC      dma_common_l1f013.c
  CC      gpio_common_all.c
  CC      i2c_common_all.c
  CC      iwdg_common_all.c
  CC      pwr_common_all.c
  CC      spi_common_all.c
  CC      spi_common_l1f124.c
  CC      timer_common_all.c
  CC      usart_common_all.c
  CC      usart_common_f124.c
  CC      rcc_common_all.c
  CC      exti_common_all.c
  CC      flash_common_f01.c
  CC      usb.c
  CC      usb_control.c
  CC      usb_standard.c
  CC      usb_f103.c
make[3]: *** No rule to make target `../../../include/libopencm3/stm32/otg_common.h', needed by `usb_f107.o'.  Stop.
make[2]: *** [lib/stm32/f1] Error 2
make[1]: *** [] Error 2
make: *** [ext] Error 2

Manage your email notification settings.

Is this email not displaying correctly? Report the issue.

Sent by Semaphore

reply via email to

[Prev in Thread] Current Thread [Next in Thread]