[Top][All Lists]

[Date Prev][Date Next][Thread Prev][Thread Next][Date Index][Thread Index]

[paparazzi-builds] [paparazzi] Build failed : master #1882

From: Semaphore
Subject: [paparazzi-builds] [paparazzi] Build failed : master #1882
Date: Sat, 16 Sep 2017 21:03:15 +0000

Build 1882 Failed For project paparazzi on branch master
Last commit for this build
Open UAS 8 Sep 15:16
57772d6 — Fix for the non streaming RTP video
Build Results
Thread #1
ls -lah $SEMAPHORE_CACHE_DIR 00:00
df -h 00:00
docker pull flixr/pprz-dev 01:00
df -h 00:00
sudo rm -rf /home/runner/{.phpbrew,.phpunit,.kerl,.kiex,.lein,.nvm,.npm,.rbenv} 00:12
df -h 00:00
git --version 00:00
git status --ignored 00:00
git submodule deinit --force . 00:00
rm -rf .git/modules 00:00
git submodule update --init --force --recursive 00:49
if [ "$SEMAPHORE_TRIGGER_SOURCE" = "scheduler" ]; then docker/ -it flixr/pprz-dev make test_all_confs ; else docker/ -it flixr/pprz-dev make test ; fi 01:00:00
( Showing only the last 30 out of 70 lines. For a complete log visit the build page )

        CC /home/pprz/paparazzi/var/aircrafts/Bebop_actuators/nps/nps/nps_autopilot_rotorcraft.o
CC /home/pprz/paparazzi/var/aircrafts/Bebop_actuators/nps/modules/air_data/air_data.o
CC /home/pprz/paparazzi/var/aircrafts/Bebop_actuators/nps/modules/geo_mag/geo_mag.o
CC /home/pprz/paparazzi/var/aircrafts/Bebop_actuators/nps/firmwares/rotorcraft/guidance/guidance_indi.o
/home/pprz/paparazzi/sw/simulator/nps/nps_autopilot_rotorcraft.c:68:2: error: #error "INDI_RPM_FEEDBACK can not be used in simulation!"
 #error "INDI_RPM_FEEDBACK can not be used in simulation!"
/home/pprz/paparazzi/conf/Makefile.nps:97: recipe for target '/home/pprz/paparazzi/var/aircrafts/Bebop_actuators/nps/nps/nps_autopilot_rotorcraft.o' failed
make[2]: *** [/home/pprz/paparazzi/var/aircrafts/Bebop_actuators/nps/nps/nps_autopilot_rotorcraft.o] Error 1
make[2]: *** Waiting for unfinished jobs.... recipe for target 'nps.compile' failed
make[1]: *** [nps.compile] Error 2

tests/aircrafts/01_compile_all_aircrafts.t .. 19/83 
#   Failed test 'Compile aircraft: Bebop_actuators, target: nps'
#   at tests/aircrafts/01_compile_all_aircrafts.t line 115.
# compiling AIRCRAFT: [Bebop_default] TARGET: [ap]

tests/aircrafts/01_compile_all_aircrafts.t .. 20/83 
Warning: AIRCRAFT=Bebop_default target=ap compiled sucessfully but had warnings:
modules/computer_vision/viewvideo.c:252:26: warning: unused variable ‘listener2’ [-Wunused-variable]
   struct video_listener *listener2 = cv_add_to_device_async(&VIEWVIDEO_CAMERA2, viewvideo_function2,

modules/computer_vision/viewvideo.c:246:26: warning: unused variable ‘listener1’ [-Wunused-variable]
   struct video_listener *listener1 = cv_add_to_device_async(&VIEWVIDEO_CAMERA, viewvideo_function1,

# compiling AIRCRAFT: [Bebop_default] TARGET: [nps]
execution expired
df -h 00:00

Manage your email notification settings.

Is this email not displaying correctly? Report the issue.

Sent by Semaphore

reply via email to

[Prev in Thread] Current Thread [Next in Thread]