[Top][All Lists]

[Date Prev][Date Next][Thread Prev][Thread Next][Date Index][Thread Index]

[paparazzi-builds] [paparazzi] Build failed : master #1889

From: Semaphore
Subject: [paparazzi-builds] [paparazzi] Build failed : master #1889
Date: Sat, 23 Sep 2017 21:03:36 +0000

Build 1889 Failed For project paparazzi on branch master
Last commit for this build
Open UAS 8 Sep 15:16
57772d6 — Fix for the non streaming RTP video
Build Results
Thread #1
ls -lah $SEMAPHORE_CACHE_DIR 00:00
df -h 00:00
docker pull flixr/pprz-dev 01:13
df -h 00:00
sudo rm -rf /home/runner/{.phpbrew,.phpunit,.kerl,.kiex,.lein,.nvm,.npm,.rbenv} 00:12
df -h 00:00
git --version 00:00
git status --ignored 00:00
git submodule deinit --force . 00:00
rm -rf .git/modules 00:00
git submodule update --init --force --recursive 00:50
if [ "$SEMAPHORE_TRIGGER_SOURCE" = "scheduler" ]; then docker/ -it flixr/pprz-dev make test_all_confs ; else docker/ -it flixr/pprz-dev make test ; fi 01:00:00
( Showing only the last 30 out of 84 lines. For a complete log visit the build page )

        /home/pprz/paparazzi/var/include/abi_messages.h:289:93: error: unknown type name ‘int8_t’
 static inline void AbiSendMsgRSSI(uint8_t sender_id, uint8_t ac_id, int8_t source_strength, int8_t rssi) {
/home/pprz/paparazzi/conf/Makefile.linux:114: recipe for target '/home/pprz/paparazzi/var/aircrafts/Bebop_Chris/ap/modules/computer_vision/cv_blob_locator.o' failed
make[2]: *** [/home/pprz/paparazzi/var/aircrafts/Bebop_Chris/ap/modules/computer_vision/cv_blob_locator.o] Error 1
make[2]: *** Waiting for unfinished jobs.... recipe for target 'ap.compile' failed
make[1]: *** [ap.compile] Error 2

#   Failed test 'Compile aircraft: Bebop_Chris, target: ap'
#   at tests/aircrafts/01_compile_all_aircrafts.t line 115.
# compiling AIRCRAFT: [Bebop_Chris] TARGET: [nps]

tests/aircrafts/01_compile_all_aircrafts.t .. 15/83 
Warning: AIRCRAFT=Bebop_Chris target=nps compiled sucessfully but had warnings:
modules/computer_vision/viewvideo.c:246:26: warning: unused variable ‘listener1’ [-Wunused-variable]
   struct video_listener *listener1 = cv_add_to_device_async(&VIEWVIDEO_CAMERA, viewvideo_function1,

modules/computer_vision/lib/vision/image.c:585:5: warning: missing initializer for field ‘count’ of ‘struct point_t’ [-Wmissing-field-initializers]

modules/computer_vision/lib/vision/image.c:589:5: warning: missing initializer for field ‘count’ of ‘struct point_t’ [-Wmissing-field-initializers]

# compiling AIRCRAFT: [Bebop_Smeur] TARGET: [ap]
execution expired
df -h 00:00

Manage your email notification settings.

Is this email not displaying correctly? Report the issue.

Sent by Semaphore

reply via email to

[Prev in Thread] Current Thread [Next in Thread]