[Top][All Lists]

[Date Prev][Date Next][Thread Prev][Thread Next][Date Index][Thread Index]

[paparazzi-builds] [paparazzi] Build failed : master #2780

From: Semaphore
Subject: [paparazzi-builds] [paparazzi] Build failed : master #2780
Date: Sun, 05 May 2019 20:08:58 +0000

Build 2780 Failed For project paparazzi on branch master
Last commit for this build
Freek van Tienen 11 Apr 21:12
009b121 — [ins] Add EKF2 from the PX4 ECL library (#2402)
Build Results
Thread #1
ls -lah $SEMAPHORE_CACHE_DIR 00:00
df -h 00:00
docker pull paparazziuav/pprz-ci 03:49
df -h 00:00
sudo rm -rf /home/runner/{.phpbrew,.phpunit,.kerl,.kiex,.lein,.nvm,.npm,.rbenv} 00:35
df -h 00:00
git --version 00:00
git config --global "address@hidden" 00:00
git config --global "Paparazzi UAV" 00:00
git status --ignored 00:01
git submodule deinit --force . 00:00
rm -rf .git/modules 00:00
git submodule update --init --force --recursive 01:47
if [ "$SEMAPHORE_TRIGGER_SOURCE" = "scheduler" ]; then docker/ -it paparazziuav/pprz-ci make test_all_confs ; else docker/ -it paparazziuav/pprz-ci make test ; fi 00:12

        xauth:  file /home/runner/.Xauthority does not exist
xauth: (argv):1:  unable to read any entries from file "(stdin)"
Building Paparazzi version v5.15_devel-39-g009b121
make -C data/maps
mkdir /home/pprz/paparazzi/conf/maps_data
DOWNLOAD: google maps version code
Updated google maps version to 842
[ -L conf/conf.xml ] || [ -f conf/conf.xml ] || cp conf/conf_example.xml conf/conf.xml
[ -L conf/control_panel.xml ] || [ -f conf/control_panel.xml ] || cp conf/control_panel_example.xml conf/control_panel.xml
cp conf/tools/blacklisted_example conf/tools/blacklisted
make -C sw/ext pprzlink.update
Check for already installed pprzlink ocaml lib
Build bytecode lib
Build native lib
+ ocamlfind ocamlopt -c -package xml-light -package ivy -pp 'camlp4o pa_macro.cmo -DHAS_BYTES_MODULE' -I common -o pprzLink.cmx
ocamlopt.opt got signal and exited
Command exited with code 2.
../../common/ocaml/Makefile:92: recipe for target 'native' failed
make[2]: *** [native] Error 10
Makefile:59: recipe for target 'libpprzlink-install' failed
make[1]: *** [libpprzlink-install] Error 2
Makefile:146: recipe for target 'libpprzlink' failed
make: *** [libpprzlink] Error 2
df -h 00:00

Manage your email notification settings.

Is this email not displaying correctly? Report the issue.

Sent by Semaphore

reply via email to

[Prev in Thread] Current Thread [Next in Thread]