[Top][All Lists]

[Date Prev][Date Next][Thread Prev][Thread Next][Date Index][Thread Index]

[paparazzi-builds] [paparazzi] Build failed : master #2865

From: Semaphore
Subject: [paparazzi-builds] [paparazzi] Build failed : master #2865
Date: Mon, 08 Jul 2019 20:05:28 +0000

Build 2865 Failed For project paparazzi on branch master
Last commit for this build
Hector Garcia de Marina 7 Jul 16:19
2289512 — Merge pull request #2447 from enacuavlab/enac_student_projects-integration
Build Results
Thread #1
ls -lah $SEMAPHORE_CACHE_DIR 00:00
df -h 00:00
docker pull paparazziuav/pprz-ci 01:54
df -h 00:00
sudo rm -rf /home/runner/{.phpbrew,.phpunit,.kerl,.kiex,.lein,.nvm,.npm,.rbenv} 00:29
df -h 00:00
git --version 00:00
git config --global "address@hidden" 00:00
git config --global "Paparazzi UAV" 00:00
git status --ignored 00:00
git submodule deinit --force . 00:00
rm -rf .git/modules 00:00
git submodule update --init --force --recursive 01:43
if [ "$SEMAPHORE_TRIGGER_SOURCE" = "scheduler" ]; then docker/ -it paparazziuav/pprz-ci make test_all_confs ; else docker/ -it paparazziuav/pprz-ci make test ; fi 00:09

        xauth:  file /home/runner/.Xauthority does not exist
xauth: (argv):1:  unable to read any entries from file "(stdin)"
Building Paparazzi version v5.15_devel-77-g2289512
make -C data/maps
mkdir /home/pprz/paparazzi/conf/maps_data
DOWNLOAD: google maps version code
Updated google maps version to 847
[ -L conf/conf.xml ] || [ -f conf/conf.xml ] || cp conf/conf_example.xml conf/conf.xml
[ -L conf/control_panel.xml ] || [ -f conf/control_panel.xml ] || cp conf/control_panel_example.xml conf/control_panel.xml
cp conf/tools/blacklisted_example conf/tools/blacklisted
make -C sw/ext pprzlink.update
Check for already installed pprzlink ocaml lib
Build bytecode lib
Build native lib
+ ocamlfind ocamlopt -c -package xml-light -package ivy -pp 'camlp4o pa_macro.cmo -DHAS_BYTES_MODULE' -I common -o pprzLink.cmx
File "", line 220, characters 19-27:
Error: Unbound value ]
Command exited with code 2.
../../common/ocaml/Makefile:92: recipe for target 'native' failed
make[2]: *** [native] Error 10
Makefile:59: recipe for target 'libpprzlink-install' failed
make[1]: *** [libpprzlink-install] Error 2
Makefile:146: recipe for target 'libpprzlink' failed
make: *** [libpprzlink] Error 2
df -h 00:00

Manage your email notification settings.

Is this email not displaying correctly? Report the issue.

Sent by Semaphore

reply via email to

[Prev in Thread] Current Thread [Next in Thread]