[Top][All Lists]

[Date Prev][Date Next][Thread Prev][Thread Next][Date Index][Thread Index]

[paparazzi-builds] [paparazzi] Build failed : master #2972

From: Semaphore
Subject: [paparazzi-builds] [paparazzi] Build failed : master #2972
Date: Wed, 09 Oct 2019 20:04:10 +0000

Build 2972 Failed For project paparazzi on branch master
Last commit for this build
Gautier Hattenberger 8 Oct 07:31
e583d16 — [jevois] add option to send VISUAL_DETECTION ABI message from jevois detection
Build Results
Thread #1
ls -lah $SEMAPHORE_CACHE_DIR 00:00
df -h 00:00
docker pull paparazziuav/pprz-ci 01:22
df -h 00:00
sudo rm -rf /home/runner/{.phpbrew,.phpunit,.kerl,.kiex,.lein,.nvm,.npm,.rbenv} 00:18
df -h 00:00
git --version 00:00
git config --global "address@hidden" 00:00
git config --global "Paparazzi UAV" 00:00
git status --ignored 00:00
git submodule deinit --force . 00:00
rm -rf .git/modules 00:00
git submodule update --init --force --recursive 00:43
if [ "$SEMAPHORE_TRIGGER_SOURCE" = "scheduler" ]; then docker/ -it paparazziuav/pprz-ci make test_all_confs ; else docker/ -it paparazziuav/pprz-ci make test ; fi 00:04
( Showing only the last 30 out of 31 lines. For a complete log visit the build page )

        xauth: (argv):1:  unable to read any entries from file "(stdin)"
Building Paparazzi version v5.15_devel-97-ge583d16
make -C data/maps
mkdir /home/pprz/paparazzi/conf/maps_data
DOWNLOAD: google maps version code
Updated google maps version to 855
[ -L conf/conf.xml ] || [ -f conf/conf.xml ] || cp conf/conf_example.xml conf/conf.xml
[ -L conf/control_panel.xml ] || [ -f conf/control_panel.xml ] || cp conf/control_panel_example.xml conf/control_panel.xml
cp conf/tools/blacklisted_example conf/tools/blacklisted
make -C sw/ext pprzlink.update
Check for already installed pprzlink ocaml lib
Build bytecode lib
+ ocamlfind ocamldep -package xml-light -package ivy -pp 'camlp4o pa_macro.cmo -DHAS_BYTES_MODULE' -modules >
Invalid argument: "output_value: abstract value (outside heap)"
File "", line 1:
Error: Error while running external preprocessor
Command line: camlp4o pa_macro.cmo -DHAS_BYTES_MODULE '' > /tmp/ocamlpp813f3a

Command exited with code 2.
../../common/ocaml/Makefile:79: recipe for target 'byte' failed
make[2]: *** [byte] Error 10
Makefile:59: recipe for target 'libpprzlink-install' failed
make[1]: *** [libpprzlink-install] Error 2
Makefile:146: recipe for target 'libpprzlink' failed
make: *** [libpprzlink] Error 2

df -h 00:00

Manage your email notification settings.

Is this email not displaying correctly? Report the issue.

Sent by Semaphore

reply via email to

[Prev in Thread] Current Thread [Next in Thread]