[Top][All Lists]

[Date Prev][Date Next][Thread Prev][Thread Next][Date Index][Thread Index]

[paparazzi-builds] [paparazzi] Build failed : gps_ubx_update #3

From: Semaphore
Subject: [paparazzi-builds] [paparazzi] Build failed : gps_ubx_update #3
Date: Thu, 19 Mar 2020 13:22:40 +0000

Build 3 Failed For project paparazzi on branch gps_ubx_update
Last commit for this build
Freek van Tienen 19 Mar 13:14
3367d12 — [misc] RTCM 2 ivy update (WIP, hardcoded AC_ID)
Build Results
Thread #1
ls -lah $SEMAPHORE_CACHE_DIR 00:00
df -h 00:00
docker pull paparazziuav/pprz-ci 01:48
df -h 00:00
sudo rm -rf /home/runner/{.phpbrew,.phpunit,.kerl,.kiex,.lein,.nvm,.npm,.rbenv} 00:36
df -h 00:00
git --version 00:00
git config --global "address@hidden" 00:00
git config --global "Paparazzi UAV" 00:00
git status --ignored 00:00
git submodule deinit --force . 00:00
rm -rf .git/modules 00:00
git submodule update --init --force --recursive 01:16
if [ "$SEMAPHORE_TRIGGER_SOURCE" = "scheduler" ]; then docker/ -it paparazziuav/pprz-ci make test_all_confs ; else docker/ -it paparazziuav/pprz-ci make test ; fi 00:35
( Showing only the last 30 out of 143 lines. For a complete log visit the build page )

        make -C sw/tools/bluegiga_usb_dongle
Building target: bluegiga_usb_driver
Finished building target: bluegiga_usb_driver
make -C sw/ground_segment/misc
CC davis2ivy
CC kestrel2ivy
CC natnet2ivy
CC sbp2ivy
CC video_synchronizer
CC sbs2ivy
rtcm2ivy.c: In function ‘ivy_send_message’:
rtcm2ivy.c:112:16: error: wait’ undeclared (first use in this function)
     nanosleep(&wait, NULL);
rtcm2ivy.c:112:16: note: each undeclared identifier is reported only once for each function it appears in
rtcm2ivy.c: At top level:
rtcm2ivy.c:200:13: warning: rtcm3_1087_callback’ defined but not used [-Wunused-function]
 static void rtcm3_1087_callback(uint8_t len, uint8_t msg[])
rtcm2ivy.c:216:13: warning: rtcm3_1097_callback’ defined but not used [-Wunused-function]
 static void rtcm3_1097_callback(uint8_t len, uint8_t msg[])
rtcm2ivy.c:232:13: warning: rtcm3_1127_callback’ defined but not used [-Wunused-function]
 static void rtcm3_1127_callback(uint8_t len, uint8_t msg[])
Makefile:121: recipe for target 'rtcm2ivy.o' failed
make[1]: *** [rtcm2ivy.o] Error 1
Makefile:188: recipe for target 'sw/ground_segment/misc' failed
make: *** [sw/ground_segment/misc] Error 2

df -h 00:00

Manage your email notification settings.

Is this email not displaying correctly? Report the issue.

Sent by Semaphore

reply via email to

[Prev in Thread] Current Thread [Next in Thread]