[Top][All Lists]

[Date Prev][Date Next][Thread Prev][Thread Next][Date Index][Thread Index]

[paparazzi-builds] [paparazzi] Build failed : master #3392

From: Semaphore
Subject: [paparazzi-builds] [paparazzi] Build failed : master #3392
Date: Thu, 03 Sep 2020 20:03:17 +0000

Build 3392 Failed For project paparazzi on branch master
Last commit for this build
Ewoud Smeur 28 Aug 13:36
79db939 — [FIX] Forgot to change name to indi_gains (#2573)
Build Results
Thread #1
ls -lah $SEMAPHORE_CACHE_DIR 00:00
df -h 00:00
docker pull paparazziuav/pprz-ci 00:51
df -h 00:00
sudo rm -rf /home/runner/{.phpbrew,.phpunit,.kerl,.kiex,.lein,.nvm,.npm,.rbenv} 00:05
df -h 00:00
git --version 00:00
git config --global "" 00:00
git config --global "Paparazzi UAV" 00:00
git status --ignored 00:00
git submodule deinit --force . 00:00
rm -rf .git/modules 00:00
git submodule update --init --force --recursive 01:14
if [ "$SEMAPHORE_TRIGGER_SOURCE" = "scheduler" ]; then docker/ -it paparazziuav/pprz-ci make test_all_confs ; else docker/ -it paparazziuav/pprz-ci make test ; fi 00:03
( Showing only the last 30 out of 31 lines. For a complete log visit the build page )

        xauth: (argv):1:  unable to read any entries from file "(stdin)"
Building Paparazzi version v5.17_devel-46-g79db939
make -C data/maps
mkdir /home/pprz/paparazzi/conf/maps_data
DOWNLOAD: google maps version code
Updated google maps version to 874
[ -L conf/conf.xml ] || [ -f conf/conf.xml ] || cp conf/conf_example.xml conf/conf.xml
[ -L conf/control_panel.xml ] || [ -f conf/control_panel.xml ] || cp conf/control_panel_example.xml conf/control_panel.xml
cp conf/tools/blacklisted_example conf/tools/blacklisted
make -C sw/ext pprzlink.update
make[1]: Entering directory '/home/pprz/paparazzi/sw/ext/pprzlink'
make[2]: Entering directory '/home/pprz/paparazzi/sw/ext/pprzlink/lib/v2.0/ocaml'
Check for already installed pprzlink ocaml lib
Build bytecode lib
+ ocamlfind ocamlc -c -safe-string -package xml-light -package ivy -pp 'camlp4o pa_macro.cmo' -I common -o pprzLink.cmo
ocamlc.opt got signal and exited
Command exited with code 2.
../../common/ocaml/Makefile:74: recipe for target 'byte' failed
make[2]: *** [byte] Error 10
make[2]: Leaving directory '/home/pprz/paparazzi/sw/ext/pprzlink/lib/v2.0/ocaml'
Makefile:59: recipe for target 'libpprzlink-install' failed
make[1]: *** [libpprzlink-install] Error 2
make[1]: Leaving directory '/home/pprz/paparazzi/sw/ext/pprzlink'
Makefile:146: recipe for target 'libpprzlink' failed
make: *** [libpprzlink] Error 2

df -h 00:00

Manage your email notification settings.

Is this email not displaying correctly? Report the issue.

Sent by Semaphore

reply via email to

[Prev in Thread] Current Thread [Next in Thread]