[Top][All Lists]

[Date Prev][Date Next][Thread Prev][Thread Next][Date Index][Thread Index]

Re: [Paparazzi-devel] Sim compilation error

From: Gareth Roberts
Subject: Re: [Paparazzi-devel] Sim compilation error
Date: Mon, 01 Nov 2010 16:13:54 -0000
User-agent: Opera Mail/10.63 (Linux)

Hi Martin,

I'm getting a similar problem with a fresh new checkout, the first make fails with

BUILD /home/me/Sources/paparazzi3/var/include/messages.h
Exception: Not_found.
make: *** [/home/me/Sources/paparazzi3/var/include/messages.h] Error 2

address@hidden:~/Sources/paparazzi3$ svn up
At revision 6319.

I am building in a chroot, but I've done that before and it worked fine.
Up to date lucid i386 in the chroot.


On Fri, 29 Oct 2010 20:56:34 +0100, Helge Walle <address@hidden> wrote:


I just updated to revision 6305. Did make clean and make.

When I tried to build a sim target I got these lines:

CC /home/helge/paparazzi3/var/TWINSTAR_II_HW/sim/arch/sim/sim_adc_generic.o
arch/sim/sim_adc_generic.c:2:25:  asm or __attribute__ before
arch/sim/sim_adc_generic.c: In function update_adc1:
arch/sim/sim_adc_generic.c:14: error: adc_generic_val1 undeclared (first use
in this function)
arch/sim/sim_adc_generic.c:14: error: (Each undeclared identifier is
reported only once
arch/sim/sim_adc_generic.c:14: error: for each function it appears in.)

I used the same configuration files that was successfully used in a
simulation just a few days ago.

Building the ap target seems to work fine.

Any hint of what might be the problem?

Thanks in advance for any help,


reply via email to

[Prev in Thread] Current Thread [Next in Thread]