[Top][All Lists]

[Date Prev][Date Next][Thread Prev][Thread Next][Date Index][Thread Index]

Re: [Paparazzi-devel] error while buiding code for quad lisa/m

From: evan igor
Subject: Re: [Paparazzi-devel] error while buiding code for quad lisa/m
Date: Sun, 8 Sep 2013 16:06:46 +0300

after making make clean then make the following error occurred 

GENERATE /home/mavel/paparazzi/var/include/messages.h
GENERATE /home/mavel/paparazzi/var/include/messages2.h
GENERATE /home/mavel/paparazzi/var/include/ubx_protocol.h
GENERATE /home/mavel/paparazzi/var/include/mtk_protocol.h
GENERATE /home/mavel/paparazzi/var/include/xsens_protocol.h
GENERATE /home/mavel/paparazzi/var/include/dl_protocol.h
GENERATE /home/mavel/paparazzi/var/include/dl_protocol2.h
GENERATE /home/mavel/paparazzi/var/include/abi_messages.h
make -C sw/ext
fatal: Needed a single revision
Unable to find current revision in submodule path 'sw/ext/libopencm3'
make[1]: *** [update_submodules] Error 1
make: *** [ext] Error 2

On Sun, Sep 8, 2013 at 3:51 PM, Felix Ruess <address@hidden> wrote:
Hi Evan,

If you update paparazzi with a git pull (or switch to a different branch), always make sure to run the toplevel make again.
When changing between different versions (branches) you might want to run a "make clean && make" to be sure everything is properly build with the current version.

Cheers, Felix

On Sun, Sep 8, 2013 at 2:44 PM, evan igor <address@hidden> wrote:
Hi everyone,

 i found this error while building the code could anyone give recommendation

Using CC   = /opt/paparazzi/arm-multilib/bin/arm-none-eabi-gcc
Using LD   = /opt/paparazzi/arm-multilib/bin/arm-none-eabi-gcc
Using CP   = /opt/paparazzi/arm-multilib/bin/arm-none-eabi-objcopy
Using DMP  = /opt/paparazzi/arm-multilib/bin/arm-none-eabi-objdump
Using NM   = /opt/paparazzi/arm-multilib/bin/arm-none-eabi-nm
Using SIZE = /opt/paparazzi/arm-multilib/bin/arm-none-eabi-size
GCC version:
arm-none-eabi-gcc (Linaro GCC 4.6-2011.09-1) 4.6.2 20110908 (prerelease)

CC /home/mavel/paparazzi/var/Quad_LisaM_2/ap/mcu.o
In file included from mcu_periph/sys_time.h:192:0,
                 from mcu.c:32:
/home/mavel/paparazzi/sw/airborne/arch/stm32/mcu_periph/sys_time_arch.h:39:36: fatal error: libopencm3/cm3/systick.h: No such file or directory
compilation terminated.
make[1]: *** [/home/mavel/paparazzi/var/Quad_LisaM_2/ap/mcu.o] Error 1
make[1]: Leaving directory `/home/mavel/paparazzi/sw/airborne'
make: *** [ap.compile] Error 2
make: Leaving directory `/home/mavel/paparazzi'

FAILED 'make -C /home/mavel/paparazzi -f AIRCRAFT=Quad_LisaM_2 ap.compile' with code 2

Paparazzi-devel mailing list

Paparazzi-devel mailing list

reply via email to

[Prev in Thread] Current Thread [Next in Thread]