[Top][All Lists]

[Date Prev][Date Next][Thread Prev][Thread Next][Date Index][Thread Index]

Re: [Qemu-block] [Qemu-devel] [PATCH v3 0/7] block: Handle null backing

From: no-reply
Subject: Re: [Qemu-block] [Qemu-devel] [PATCH v3 0/7] block: Handle null backing link
Date: Sat, 24 Feb 2018 12:30:31 -0800 (PST)


This series failed address@hidden build test. Please find the testing commands 
their output below. If you have Docker installed, you can probably reproduce it

Type: series
Message-id: address@hidden
Subject: [Qemu-devel] [PATCH v3 0/7] block: Handle null backing link

set -e
git submodule update --init dtc
# Let docker tests dump environment info
export SHOW_ENV=1
export J=8
time make address@hidden

Updating 3c8cf5a9c21ff8782164d1def7f44bd888713384
From https://github.com/patchew-project/qemu
 * [new tag]               patchew/address@hidden -> patchew/address@hidden
Switched to a new branch 'test'
ae347da068 block: Deprecate "backing": ""
3342c14431 block: Handle null backing link
84a81f6c30 qapi: Make more of qobject_to()
d4231e47f1 qapi: Remove qobject_to_X() functions
1f269ff09a qapi: Replace qobject_to_X(o) by qobject_to(o, X)
7075fc4b99 qapi: Add qobject_to()
07f4ad1be0 compiler: Add QEMU_BUILD_BUG_MSG() macro

Submodule 'dtc' (git://git.qemu-project.org/dtc.git) registered for path 'dtc'
Cloning into '/var/tmp/patchew-tester-tmp-v9s3mez6/src/dtc'...
Submodule path 'dtc': checked out 'e54388015af1fb4bf04d0bca99caba1074d9cc42'
  BUILD   min-glib
make[1]: Entering directory '/var/tmp/patchew-tester-tmp-v9s3mez6/src'
Cloning into 
Checking out files:  45% (2674/5878)   
Checking out files:  46% (2704/5878)   
Checking out files:  47% (2763/5878)   
Checking out files:  48% (2822/5878)   
Checking out files:  49% (2881/5878)   
Checking out files:  50% (2939/5878)   
Checking out files:  51% (2998/5878)   
Checking out files:  52% (3057/5878)   
Checking out files:  53% (3116/5878)   
Checking out files:  54% (3175/5878)   
Checking out files:  55% (3233/5878)   
Checking out files:  56% (3292/5878)   
Checking out files:  57% (3351/5878)   
Checking out files:  58% (3410/5878)   
Checking out files:  59% (3469/5878)   
Checking out files:  60% (3527/5878)   
Checking out files:  61% (3586/5878)   
Checking out files:  62% (3645/5878)   
Checking out files:  63% (3704/5878)   
Checking out files:  64% (3762/5878)   
Checking out files:  65% (3821/5878)   
Checking out files:  66% (3880/5878)   
Checking out files:  67% (3939/5878)   
Checking out files:  68% (3998/5878)   
Checking out files:  69% (4056/5878)   
Checking out files:  70% (4115/5878)   
Checking out files:  71% (4174/5878)   
Checking out files:  72% (4233/5878)   
Checking out files:  73% (4291/5878)   
Checking out files:  74% (4350/5878)   
Checking out files:  75% (4409/5878)   
Checking out files:  76% (4468/5878)   
Checking out files:  77% (4527/5878)   
Checking out files:  78% (4585/5878)   
Checking out files:  79% (4644/5878)   
Checking out files:  80% (4703/5878)   
Checking out files:  81% (4762/5878)   
Checking out files:  82% (4820/5878)   
Checking out files:  83% (4879/5878)   
Checking out files:  84% (4938/5878)   
Checking out files:  85% (4997/5878)   
Checking out files:  86% (5056/5878)   
Checking out files:  87% (5114/5878)   
Checking out files:  88% (5173/5878)   
Checking out files:  89% (5232/5878)   
Checking out files:  90% (5291/5878)   
Checking out files:  91% (5349/5878)   
Checking out files:  92% (5408/5878)   
Checking out files:  92% (5454/5878)   
Checking out files:  93% (5467/5878)   
Checking out files:  94% (5526/5878)   
Checking out files:  95% (5585/5878)   
Checking out files:  96% (5643/5878)   
Checking out files:  97% (5702/5878)   
Checking out files:  98% (5761/5878)   
Checking out files:  99% (5820/5878)   
Checking out files: 100% (5878/5878)   
Checking out files: 100% (5878/5878), done.
Your branch is up-to-date with 'origin/test'.
Submodule 'dtc' (git://git.qemu-project.org/dtc.git) registered for path 'dtc'
Cloning into 
Submodule path 'dtc': checked out 'e54388015af1fb4bf04d0bca99caba1074d9cc42'
Submodule 'ui/keycodemapdb' (git://git.qemu.org/keycodemapdb.git) registered 
for path 'ui/keycodemapdb'
Cloning into 
Submodule path 'ui/keycodemapdb': checked out 
    RUN test-build in qemu:min-glib 
Environment variables:

Configure options:
--enable-werror --target-list=x86_64-softmmu,aarch64-softmmu 
No C++ compiler available; disabling C++ specific optional code
Install prefix    /tmp/qemu-test/install
BIOS directory    /tmp/qemu-test/install/share/qemu
firmware path     /tmp/qemu-test/install/share/qemu-firmware
binary directory  /tmp/qemu-test/install/bin
library directory /tmp/qemu-test/install/lib
module directory  /tmp/qemu-test/install/lib/qemu
libexec directory /tmp/qemu-test/install/libexec
include directory /tmp/qemu-test/install/include
config directory  /tmp/qemu-test/install/etc
local state directory   /tmp/qemu-test/install/var
Manual directory  /tmp/qemu-test/install/share/man
ELF interp prefix /usr/gnemul/qemu-%M
Source path       /tmp/qemu-test/src
GIT binary        git
GIT submodules    
C compiler        cc
Host C compiler   cc
C++ compiler      
Objective-C compiler cc
ARFLAGS           rv
QEMU_CFLAGS       -I/usr/include/pixman-1   -I$(SRC_PATH)/dtc/libfdt -pthread 
-I/usr/include/glib-2.0 -I/usr/lib64/glib-2.0/include   -fPIE -DPIE -m64 -mcx16 
-Wredundant-decls -Wall -Wundef -Wwrite-strings -Wmissing-prototypes 
-fno-strict-aliasing -fno-common -fwrapv  -Wendif-labels 
-Wno-missing-include-dirs -Wempty-body -Wnested-externs -Wformat-security 
-Wformat-y2k -Winit-self -Wignored-qualifiers -Wold-style-declaration 
-Wold-style-definition -Wtype-limits -fstack-protector-all -Wno-missing-braces
LDFLAGS           -Wl,--warn-common -Wl,-z,relro -Wl,-z,now -pie -m64 -g 
make              make
install           install
python            python -B
smbd              /usr/sbin/smbd
module support    no
host CPU          x86_64
host big endian   no
target list       x86_64-softmmu aarch64-softmmu
gprof enabled     no
sparse enabled    no
strip binaries    yes
profiler          no
static build      no
SDL support       yes (1.2.14)
GTK support       no 
GTK GL support    no
VTE support       no 
TLS priority      NORMAL
GNUTLS support    no
GNUTLS rnd        no
libgcrypt         no
libgcrypt kdf     no
nettle            no 
nettle kdf        no
libtasn1          no
curses support    no
virgl support     no
curl support      no
mingw32 support   no
Audio drivers     oss
Block whitelist (rw) 
Block whitelist (ro) 
VirtFS support    no
Multipath support no
VNC support       yes
VNC SASL support  no
VNC JPEG support  no
VNC PNG support   no
xen support       no
brlapi support    no
bluez  support    no
Documentation     no
PIE               yes
vde support       no
netmap support    no
Linux AIO support no
ATTR/XATTR support yes
Install blobs     yes
KVM support       yes
HAX support       no
HVF support       no
WHPX support      no
TCG support       yes
TCG debug enabled no
TCG interpreter   no
malloc trim support yes
RDMA support      no
fdt support       yes
preadv support    yes
fdatasync         yes
madvise           yes
posix_madvise     yes
posix_memalign    yes
libcap-ng support no
vhost-net support yes
vhost-scsi support yes
vhost-vsock support yes
vhost-user support yes
Trace backends    log
spice support     no 
rbd support       no
xfsctl support    no
smartcard support no
libusb            no
usb net redir     no
OpenGL support    no
OpenGL dmabufs    no
libiscsi support  no
libnfs support    no
build guest agent yes
QGA VSS support   no
QGA w32 disk info no
QGA MSI support   no
seccomp support   no
coroutine backend ucontext
coroutine pool    yes
debug stack usage no
crypto afalg      no
GlusterFS support no
gcov              gcov
gcov enabled      no
TPM support       yes
libssh2 support   no
TPM passthrough   yes
TPM emulator      yes
QOM debugging     yes
Live block migration yes
lzo support       no
snappy support    no
bzip2 support     no
NUMA host support no
libxml2           no
tcmalloc support  no
jemalloc support  no
avx2 optimization no
replication support yes
VxHS block device no
capstone          no

WARNING: Use of SDL 1.2 is deprecated and will be removed in
WARNING: future releases. Please switch to using SDL 2.0
mkdir -p dtc/libfdt
mkdir -p dtc/tests
  GEN     x86_64-softmmu/config-devices.mak.tmp
  GEN     config-host.h
  GEN     aarch64-softmmu/config-devices.mak.tmp
  GEN     qemu-options.def
  GEN     qapi-types.h
  GEN     qapi-visit.h
  GEN     qmp-commands.h
  GEN     qapi-event.h
  GEN     qmp-marshal.c
  GEN     x86_64-softmmu/config-devices.mak
  GEN     aarch64-softmmu/config-devices.mak
  GEN     qapi-types.c
  GEN     qapi-visit.c
  GEN     qapi-event.c
  GEN     qmp-introspect.h
  GEN     qmp-introspect.c
  GEN     trace/generated-tcg-tracers.h
  GEN     trace/generated-helpers-wrappers.h
  GEN     trace/generated-helpers.h
  GEN     trace/generated-helpers.c
  GEN     module_block.h
  GEN     ui/input-keymap-atset1-to-qcode.c
  GEN     ui/input-keymap-linux-to-qcode.c
  GEN     ui/input-keymap-qcode-to-atset1.c
  GEN     ui/input-keymap-qcode-to-atset2.c
  GEN     ui/input-keymap-qcode-to-atset3.c
  GEN     ui/input-keymap-qcode-to-linux.c
  GEN     ui/input-keymap-qcode-to-qnum.c
  GEN     ui/input-keymap-qcode-to-sun.c
  GEN     ui/input-keymap-qnum-to-qcode.c
  GEN     ui/input-keymap-usb-to-qcode.c
  GEN     ui/input-keymap-win32-to-qcode.c
  GEN     ui/input-keymap-x11-to-qcode.c
  GEN     ui/input-keymap-xorgevdev-to-qcode.c
  GEN     ui/input-keymap-xorgkbd-to-qcode.c
  GEN     ui/input-keymap-xorgxquartz-to-qcode.c
  GEN     ui/input-keymap-xorgxwin-to-qcode.c
  GEN     tests/test-qapi-types.h
  GEN     tests/test-qapi-visit.h
  GEN     tests/test-qmp-commands.h
  GEN     tests/test-qapi-event.h
  GEN     tests/test-qmp-introspect.h
  GEN     trace-root.h
  GEN     util/trace.h
  GEN     crypto/trace.h
  GEN     io/trace.h
  GEN     migration/trace.h
  GEN     block/trace.h
  GEN     chardev/trace.h
  GEN     hw/block/trace.h
  GEN     hw/block/dataplane/trace.h
  GEN     hw/char/trace.h
  GEN     hw/intc/trace.h
  GEN     hw/net/trace.h
  GEN     hw/rdma/trace.h
  GEN     hw/rdma/vmw/trace.h
  GEN     hw/virtio/trace.h
  GEN     hw/audio/trace.h
  GEN     hw/misc/trace.h
  GEN     hw/misc/macio/trace.h
  GEN     hw/usb/trace.h
  GEN     hw/scsi/trace.h
  GEN     hw/nvram/trace.h
  GEN     hw/display/trace.h
  GEN     hw/input/trace.h
  GEN     hw/timer/trace.h
  GEN     hw/dma/trace.h
  GEN     hw/sparc/trace.h
  GEN     hw/sparc64/trace.h
  GEN     hw/sd/trace.h
  GEN     hw/isa/trace.h
  GEN     hw/mem/trace.h
  GEN     hw/i386/trace.h
  GEN     hw/i386/xen/trace.h
  GEN     hw/9pfs/trace.h
  GEN     hw/ppc/trace.h
  GEN     hw/pci/trace.h
  GEN     hw/pci-host/trace.h
  GEN     hw/s390x/trace.h
  GEN     hw/vfio/trace.h
  GEN     hw/acpi/trace.h
  GEN     hw/arm/trace.h
  GEN     hw/alpha/trace.h
  GEN     hw/hppa/trace.h
  GEN     hw/xen/trace.h
  GEN     hw/ide/trace.h
  GEN     ui/trace.h
  GEN     audio/trace.h
  GEN     net/trace.h
  GEN     target/arm/trace.h
  GEN     target/i386/trace.h
  GEN     target/mips/trace.h
  GEN     target/sparc/trace.h
  GEN     target/s390x/trace.h
  GEN     target/ppc/trace.h
  GEN     qom/trace.h
  GEN     linux-user/trace.h
  GEN     qapi/trace.h
  GEN     accel/tcg/trace.h
  GEN     accel/kvm/trace.h
  GEN     nbd/trace.h
  GEN     scsi/trace.h
  GEN     trace-root.c
  GEN     util/trace.c
  GEN     crypto/trace.c
  GEN     io/trace.c
  GEN     migration/trace.c
  GEN     block/trace.c
  GEN     chardev/trace.c
  GEN     hw/block/trace.c
  GEN     hw/block/dataplane/trace.c
  GEN     hw/char/trace.c
  GEN     hw/intc/trace.c
  GEN     hw/net/trace.c
  GEN     hw/rdma/trace.c
  GEN     hw/rdma/vmw/trace.c
  GEN     hw/virtio/trace.c
  GEN     hw/audio/trace.c
  GEN     hw/misc/trace.c
  GEN     hw/misc/macio/trace.c
  GEN     hw/usb/trace.c
  GEN     hw/scsi/trace.c
  GEN     hw/nvram/trace.c
  GEN     hw/display/trace.c
  GEN     hw/input/trace.c
  GEN     hw/timer/trace.c
  GEN     hw/dma/trace.c
  GEN     hw/sparc/trace.c
  GEN     hw/sparc64/trace.c
  GEN     hw/sd/trace.c
  GEN     hw/isa/trace.c
  GEN     hw/mem/trace.c
  GEN     hw/i386/trace.c
  GEN     hw/i386/xen/trace.c
  GEN     hw/9pfs/trace.c
  GEN     hw/ppc/trace.c
  GEN     hw/pci/trace.c
  GEN     hw/pci-host/trace.c
  GEN     hw/s390x/trace.c
  GEN     hw/vfio/trace.c
  GEN     hw/acpi/trace.c
  GEN     hw/arm/trace.c
  GEN     hw/alpha/trace.c
  GEN     hw/hppa/trace.c
  GEN     hw/xen/trace.c
  GEN     hw/ide/trace.c
  GEN     ui/trace.c
  GEN     audio/trace.c
  GEN     net/trace.c
  GEN     target/arm/trace.c
  GEN     target/i386/trace.c
  GEN     target/mips/trace.c
  GEN     target/sparc/trace.c
  GEN     target/s390x/trace.c
  GEN     target/ppc/trace.c
  GEN     qom/trace.c
  GEN     linux-user/trace.c
  GEN     qapi/trace.c
  GEN     accel/tcg/trace.c
  GEN     accel/kvm/trace.c
  GEN     nbd/trace.c
  GEN     scsi/trace.c
  GEN     config-all-devices.mak
         DEP /tmp/qemu-test/src/dtc/tests/dumptrees.c
         DEP /tmp/qemu-test/src/dtc/tests/trees.S
         DEP /tmp/qemu-test/src/dtc/tests/testutils.c
         DEP /tmp/qemu-test/src/dtc/tests/value-labels.c
         DEP /tmp/qemu-test/src/dtc/tests/asm_tree_dump.c
         DEP /tmp/qemu-test/src/dtc/tests/truncated_property.c
         DEP /tmp/qemu-test/src/dtc/tests/check_path.c
         DEP /tmp/qemu-test/src/dtc/tests/overlay_bad_fixup.c
         DEP /tmp/qemu-test/src/dtc/tests/overlay.c
         DEP /tmp/qemu-test/src/dtc/tests/subnode_iterate.c
         DEP /tmp/qemu-test/src/dtc/tests/property_iterate.c
         DEP /tmp/qemu-test/src/dtc/tests/integer-expressions.c
         DEP /tmp/qemu-test/src/dtc/tests/utilfdt_test.c
         DEP /tmp/qemu-test/src/dtc/tests/path_offset_aliases.c
         DEP /tmp/qemu-test/src/dtc/tests/add_subnode_with_nops.c
         DEP /tmp/qemu-test/src/dtc/tests/dtbs_equal_unordered.c
         DEP /tmp/qemu-test/src/dtc/tests/dtb_reverse.c
         DEP /tmp/qemu-test/src/dtc/tests/dtbs_equal_ordered.c
         DEP /tmp/qemu-test/src/dtc/tests/extra-terminating-null.c
         DEP /tmp/qemu-test/src/dtc/tests/incbin.c
         DEP /tmp/qemu-test/src/dtc/tests/boot-cpuid.c
         DEP /tmp/qemu-test/src/dtc/tests/phandle_format.c
         DEP /tmp/qemu-test/src/dtc/tests/path-references.c
         DEP /tmp/qemu-test/src/dtc/tests/references.c
         DEP /tmp/qemu-test/src/dtc/tests/string_escapes.c
         DEP /tmp/qemu-test/src/dtc/tests/propname_escapes.c
         DEP /tmp/qemu-test/src/dtc/tests/appendprop2.c
         DEP /tmp/qemu-test/src/dtc/tests/del_node.c
         DEP /tmp/qemu-test/src/dtc/tests/appendprop1.c
         DEP /tmp/qemu-test/src/dtc/tests/del_property.c
         DEP /tmp/qemu-test/src/dtc/tests/setprop.c
         DEP /tmp/qemu-test/src/dtc/tests/set_name.c
         DEP /tmp/qemu-test/src/dtc/tests/open_pack.c
         DEP /tmp/qemu-test/src/dtc/tests/rw_tree1.c
         DEP /tmp/qemu-test/src/dtc/tests/mangle-layout.c
         DEP /tmp/qemu-test/src/dtc/tests/nopulate.c
         DEP /tmp/qemu-test/src/dtc/tests/move_and_save.c
         DEP /tmp/qemu-test/src/dtc/tests/sw_tree1.c
         DEP /tmp/qemu-test/src/dtc/tests/nop_node.c
         DEP /tmp/qemu-test/src/dtc/tests/nop_property.c
         DEP /tmp/qemu-test/src/dtc/tests/setprop_inplace.c
         DEP /tmp/qemu-test/src/dtc/tests/stringlist.c
         DEP /tmp/qemu-test/src/dtc/tests/addr_size_cells.c
         DEP /tmp/qemu-test/src/dtc/tests/sized_cells.c
         DEP /tmp/qemu-test/src/dtc/tests/notfound.c
         DEP /tmp/qemu-test/src/dtc/tests/char_literal.c
         DEP /tmp/qemu-test/src/dtc/tests/get_alias.c
         DEP /tmp/qemu-test/src/dtc/tests/node_offset_by_compatible.c
         DEP /tmp/qemu-test/src/dtc/tests/node_check_compatible.c
         DEP /tmp/qemu-test/src/dtc/tests/node_offset_by_phandle.c
         DEP /tmp/qemu-test/src/dtc/tests/node_offset_by_prop_value.c
         DEP /tmp/qemu-test/src/dtc/tests/parent_offset.c
         DEP /tmp/qemu-test/src/dtc/tests/supernode_atdepth_offset.c
         DEP /tmp/qemu-test/src/dtc/tests/get_path.c
         DEP /tmp/qemu-test/src/dtc/tests/get_phandle.c
         DEP /tmp/qemu-test/src/dtc/tests/getprop.c
         DEP /tmp/qemu-test/src/dtc/tests/get_name.c
         DEP /tmp/qemu-test/src/dtc/tests/path_offset.c
         DEP /tmp/qemu-test/src/dtc/tests/subnode_offset.c
         DEP /tmp/qemu-test/src/dtc/tests/find_property.c
         DEP /tmp/qemu-test/src/dtc/tests/root_node.c
         DEP /tmp/qemu-test/src/dtc/tests/get_mem_rsv.c
         DEP /tmp/qemu-test/src/dtc/libfdt/fdt_overlay.c
         DEP /tmp/qemu-test/src/dtc/libfdt/fdt_addresses.c
         DEP /tmp/qemu-test/src/dtc/libfdt/fdt_empty_tree.c
         DEP /tmp/qemu-test/src/dtc/libfdt/fdt_strerror.c
         DEP /tmp/qemu-test/src/dtc/libfdt/fdt_rw.c
         DEP /tmp/qemu-test/src/dtc/libfdt/fdt_sw.c
         DEP /tmp/qemu-test/src/dtc/libfdt/fdt_ro.c
         DEP /tmp/qemu-test/src/dtc/libfdt/fdt_wip.c
         DEP /tmp/qemu-test/src/dtc/libfdt/fdt.c
         DEP /tmp/qemu-test/src/dtc/fdtoverlay.c
         DEP /tmp/qemu-test/src/dtc/util.c
         DEP /tmp/qemu-test/src/dtc/fdtput.c
         DEP /tmp/qemu-test/src/dtc/fdtget.c
         DEP /tmp/qemu-test/src/dtc/fdtdump.c
         LEX convert-dtsv0-lexer.lex.c
make[1]: flex: Command not found
         DEP /tmp/qemu-test/src/dtc/srcpos.c
         BISON dtc-parser.tab.c
make[1]: bison: Command not found
         LEX dtc-lexer.lex.c
make[1]: flex: Command not found
         DEP /tmp/qemu-test/src/dtc/livetree.c
         DEP /tmp/qemu-test/src/dtc/treesource.c
         DEP /tmp/qemu-test/src/dtc/fstree.c
         DEP /tmp/qemu-test/src/dtc/flattree.c
         DEP /tmp/qemu-test/src/dtc/dtc.c
         DEP /tmp/qemu-test/src/dtc/data.c
         DEP /tmp/qemu-test/src/dtc/checks.c
        CHK version_gen.h
         BISON dtc-parser.tab.c
         LEX dtc-lexer.lex.c
make[1]: bison: Command not found
make[1]: flex: Command not found
         LEX convert-dtsv0-lexer.lex.c
make[1]: flex: Command not found
        UPD version_gen.h
         DEP /tmp/qemu-test/src/dtc/util.c
         LEX convert-dtsv0-lexer.lex.c
make[1]: flex: Command not found
         LEX dtc-lexer.lex.c
make[1]: flex: Command not found
         BISON dtc-parser.tab.c
make[1]: bison: Command not found
         CC libfdt/fdt.o
         CC libfdt/fdt_ro.o
         CC libfdt/fdt_wip.o
         CC libfdt/fdt_rw.o
         CC libfdt/fdt_sw.o
         CC libfdt/fdt_strerror.o
         CC libfdt/fdt_empty_tree.o
         CC libfdt/fdt_addresses.o
         CC libfdt/fdt_overlay.o
         AR libfdt/libfdt.a
ar: creating libfdt/libfdt.a
a - libfdt/fdt.o
a - libfdt/fdt_ro.o
a - libfdt/fdt_wip.o
a - libfdt/fdt_sw.o
a - libfdt/fdt_rw.o
a - libfdt/fdt_strerror.o
a - libfdt/fdt_empty_tree.o
a - libfdt/fdt_addresses.o
a - libfdt/fdt_overlay.o
mkdir -p dtc/libfdt
mkdir -p dtc/tests
         LEX convert-dtsv0-lexer.lex.c
         BISON dtc-parser.tab.c
make[1]: flex: Command not found
make[1]: bison: Command not found
         LEX dtc-lexer.lex.c
make[1]: flex: Command not found
  CC      tests/qemu-iotests/socket_scm_helper.o
  GEN     qga/qapi-generated/qga-qapi-types.h
  GEN     qga/qapi-generated/qga-qmp-commands.h
  GEN     qga/qapi-generated/qga-qapi-visit.c
  GEN     qga/qapi-generated/qga-qapi-visit.h
  GEN     qga/qapi-generated/qga-qmp-marshal.c
  GEN     qga/qapi-generated/qga-qapi-types.c
  CC      qmp-introspect.o
  CC      qapi-types.o
  CC      qapi-visit.o
  CC      qapi-event.o
  CC      qapi/qapi-visit-core.o
  CC      qapi/qapi-dealloc-visitor.o
  CC      qapi/qobject-input-visitor.o
  CC      qapi/qobject-output-visitor.o
  CC      qapi/qmp-registry.o
  CC      qapi/qmp-dispatch.o
  CC      qapi/string-input-visitor.o
  CC      qapi/string-output-visitor.o
  CC      qapi/opts-visitor.o
  CC      qapi/qapi-clone-visitor.o
  CC      qapi/qmp-event.o
  CC      qapi/qapi-util.o
  CC      qobject/qnull.o
  CC      qobject/qnum.o
  CC      qobject/qstring.o
  CC      qobject/qdict.o
  CC      qobject/qlist.o
  CC      qobject/qbool.o
  CC      qobject/qlit.o
  CC      qobject/qjson.o
  CC      qobject/qobject.o
  CC      qobject/json-lexer.o
  CC      qobject/json-streamer.o
  CC      qobject/json-parser.o
  CC      trace/control.o
  CC      trace/qmp.o
  CC      util/osdep.o
  CC      util/cutils.o
  CC      util/unicode.o
  CC      util/qemu-timer-common.o
  CC      util/bufferiszero.o
  CC      util/lockcnt.o
  CC      util/aiocb.o
  CC      util/async.o
  CC      util/thread-pool.o
  CC      util/qemu-timer.o
  CC      util/main-loop.o
  CC      util/iohandler.o
  CC      util/aio-posix.o
  CC      util/compatfd.o
  CC      util/event_notifier-posix.o
  CC      util/mmap-alloc.o
  CC      util/oslib-posix.o
  CC      util/qemu-openpty.o
  CC      util/qemu-thread-posix.o
  CC      util/memfd.o
  CC      util/envlist.o
  CC      util/path.o
  CC      util/module.o
  CC      util/host-utils.o
  CC      util/bitmap.o
  CC      util/bitops.o
  CC      util/hbitmap.o
  CC      util/fifo8.o
  CC      util/acl.o
  CC      util/cacheinfo.o
  CC      util/error.o
  CC      util/qemu-error.o
  CC      util/id.o
  CC      util/iov.o
  CC      util/qemu-config.o
  CC      util/qemu-sockets.o
  CC      util/uri.o
  CC      util/notify.o
  CC      util/qemu-option.o
  CC      util/qemu-progress.o
  CC      util/keyval.o
  CC      util/hexdump.o
  CC      util/crc32c.o
  CC      util/uuid.o
  CC      util/throttle.o
  CC      util/getauxval.o
  CC      util/readline.o
  CC      util/rcu.o
  CC      util/qemu-coroutine.o
  CC      util/qemu-coroutine-lock.o
  CC      util/qemu-coroutine-io.o
  CC      util/qemu-coroutine-sleep.o
  CC      util/coroutine-ucontext.o
  CC      util/timed-average.o
  CC      util/buffer.o
  CC      util/base64.o
  CC      util/log.o
  CC      util/pagesize.o
  CC      util/qdist.o
  CC      util/qht.o
  CC      util/range.o
  CC      util/stats64.o
  CC      util/systemd.o
  CC      util/vfio-helpers.o
  CC      trace-root.o
  CC      util/trace.o
  CC      crypto/trace.o
  CC      io/trace.o
  CC      migration/trace.o
  CC      block/trace.o
  CC      chardev/trace.o
  CC      hw/block/trace.o
  CC      hw/block/dataplane/trace.o
  CC      hw/char/trace.o
  CC      hw/intc/trace.o
  CC      hw/net/trace.o
  CC      hw/rdma/trace.o
  CC      hw/rdma/vmw/trace.o
  CC      hw/virtio/trace.o
  CC      hw/audio/trace.o
  CC      hw/misc/trace.o
  CC      hw/misc/macio/trace.o
  CC      hw/usb/trace.o
  CC      hw/scsi/trace.o
  CC      hw/nvram/trace.o
  CC      hw/display/trace.o
  CC      hw/input/trace.o
  CC      hw/timer/trace.o
  CC      hw/dma/trace.o
  CC      hw/sparc/trace.o
  CC      hw/sparc64/trace.o
  CC      hw/sd/trace.o
  CC      hw/isa/trace.o
  CC      hw/mem/trace.o
  CC      hw/i386/trace.o
  CC      hw/i386/xen/trace.o
  CC      hw/9pfs/trace.o
  CC      hw/ppc/trace.o
  CC      hw/pci/trace.o
  CC      hw/pci-host/trace.o
  CC      hw/s390x/trace.o
  CC      hw/vfio/trace.o
  CC      hw/acpi/trace.o
  CC      hw/arm/trace.o
  CC      hw/alpha/trace.o
  CC      hw/hppa/trace.o
  CC      hw/xen/trace.o
  CC      hw/ide/trace.o
  CC      ui/trace.o
  CC      audio/trace.o
  CC      net/trace.o
  CC      target/arm/trace.o
  CC      target/i386/trace.o
  CC      target/mips/trace.o
  CC      target/sparc/trace.o
  CC      target/s390x/trace.o
  CC      target/ppc/trace.o
  CC      qom/trace.o
  CC      qapi/trace.o
  CC      linux-user/trace.o
  CC      accel/tcg/trace.o
  CC      accel/kvm/trace.o
  CC      nbd/trace.o
  CC      scsi/trace.o
  CC      crypto/pbkdf-stub.o
  CC      stubs/arch-query-cpu-def.o
  CC      stubs/arch-query-cpu-model-expansion.o
  CC      stubs/arch-query-cpu-model-baseline.o
  CC      stubs/arch-query-cpu-model-comparison.o
  CC      stubs/bdrv-next-monitor-owned.o
  CC      stubs/blk-commit-all.o
  CC      stubs/blockdev-close-all-bdrv-states.o
  CC      stubs/clock-warp.o
  CC      stubs/cpu-get-clock.o
  CC      stubs/cpu-get-icount.o
  CC      stubs/dump.o
  CC      stubs/error-printf.o
  CC      stubs/fdset.o
  CC      stubs/gdbstub.o
  CC      stubs/get-vm-name.o
  CC      stubs/iothread.o
  CC      stubs/iothread-lock.o
  CC      stubs/is-daemonized.o
  CC      stubs/machine-init-done.o
  CC      stubs/migr-blocker.o
  CC      stubs/change-state-handler.o
  CC      stubs/monitor.o
  CC      stubs/notify-event.o
  CC      stubs/qtest.o
  CC      stubs/replay.o
  CC      stubs/runstate-check.o
  CC      stubs/set-fd-handler.o
  CC      stubs/slirp.o
  CC      stubs/sysbus.o
  CC      stubs/tpm.o
  CC      stubs/trace-control.o
  CC      stubs/uuid.o
  CC      stubs/vm-stop.o
  CC      stubs/vmstate.o
  CC      stubs/qmp_pc_dimm.o
  CC      stubs/target-monitor-defs.o
  CC      stubs/target-get-monitor-def.o
  CC      stubs/pc_madt_cpu_entry.o
  CC      stubs/vmgenid.o
  CC      stubs/xen-common.o
  CC      stubs/xen-hvm.o
  CC      stubs/pci-host-piix.o
  CC      contrib/ivshmem-client/main.o
  CC      stubs/ram-block.o
  CC      contrib/ivshmem-client/ivshmem-client.o
  CC      contrib/ivshmem-server/ivshmem-server.o
  CC      contrib/ivshmem-server/main.o
  CC      qemu-nbd.o
  CC      block.o
  CC      blockjob.o
  CC      replication.o
  CC      qemu-io-cmds.o
  CC      block/raw-format.o
  CC      block/qcow.o
  CC      block/vdi.o
  CC      block/vmdk.o
  CC      block/cloop.o
  CC      block/bochs.o
  CC      block/vpc.o
  CC      block/vvfat.o
/tmp/qemu-test/src/block.c: In function 'bdrv_open_inherit':
/tmp/qemu-test/src/block.c:2603: error: dereferencing pointer to incomplete type
/tmp/qemu-test/src/block.c:2603: warning: type defaults to 'int' in declaration 
of '__mptr'
/tmp/qemu-test/src/block.c:2603: error: dereferencing pointer to incomplete type
/tmp/qemu-test/src/block.c:2603: error: invalid use of incomplete typedef 
make: *** [block.o] Error 1
make: *** Waiting for unfinished jobs....
Traceback (most recent call last):
  File "./tests/docker/docker.py", line 407, in <module>
  File "./tests/docker/docker.py", line 404, in main
    return args.cmdobj.run(args, argv)
  File "./tests/docker/docker.py", line 261, in run
    return Docker().run(argv, args.keep, quiet=args.quiet)
  File "./tests/docker/docker.py", line 229, in run
  File "./tests/docker/docker.py", line 147, in _do_check
    return subprocess.check_call(self._command + cmd, **kwargs)
  File "/usr/lib64/python2.7/subprocess.py", line 186, in check_call
    raise CalledProcessError(retcode, cmd)
subprocess.CalledProcessError: Command '['docker', 'run', '--label', 
'com.qemu.instance.uuid=66f225a019a111e8b39a52540069c830', '-u', '0', 
'--security-opt', 'seccomp=unconfined', '--rm', '--net=none', '-e', 
'TARGET_LIST=', '-e', 'EXTRA_CONFIGURE_OPTS=', '-e', 'V=', '-e', 'J=8', '-e', 
'DEBUG=', '-e', 'SHOW_ENV=1', '-e', 'CCACHE_DIR=/var/tmp/ccache', '-v', 
'/root/.cache/qemu-docker-ccache:/var/tmp/ccache:z', '-v', 
 'qemu:min-glib', '/var/tmp/qemu/run', 'test-build']' returned non-zero exit 
status 2
make[1]: *** [tests/docker/Makefile.include:129: docker-run] Error 1
make[1]: Leaving directory '/var/tmp/patchew-tester-tmp-v9s3mez6/src'
make: *** [tests/docker/Makefile.include:163: address@hidden Error 2

real    1m17.622s
user    0m4.131s
sys     0m3.501s
=== OUTPUT END ===

Test command exited with code: 2

Email generated automatically by Patchew [http://patchew.org/].
Please send your feedback to address@hidden

reply via email to

[Prev in Thread] Current Thread [Next in Thread]