[Top][All Lists]

[Date Prev][Date Next][Thread Prev][Thread Next][Date Index][Thread Index]

Re: [Qemu-devel] [PATCH 0/2] ppc: minor Mac fixes

From: Mark Cave-Ayland
Subject: Re: [Qemu-devel] [PATCH 0/2] ppc: minor Mac fixes
Date: Fri, 22 Jun 2018 12:19:59 +0100
User-agent: Mozilla/5.0 (X11; Linux x86_64; rv:52.0) Gecko/20100101 Thunderbird/52.8.0

On 22/06/18 12:16, address@hidden wrote:


This series failed address@hidden build test. Please find the testing commands 
their output below. If you have Docker installed, you can probably reproduce it

Type: series
Message-id: address@hidden
Subject: [Qemu-devel] [PATCH 0/2] ppc: minor Mac fixes

(lots cut)

   CC      hw/acpi/core.o
   CC      hw/acpi/piix4.o
   CC      hw/acpi/pcihp.o
   CC      hw/acpi/ich9.o
   CC      hw/acpi/tco.o
   CC      hw/acpi/cpu_hotplug.o
   CC      hw/acpi/memory_hotplug.o
/tmp/qemu-test/src/nbd/server.c: In function 'nbd_trip':
/tmp/qemu-test/src/nbd/server.c:1980:19: error: 'end' may be used uninitialized 
in this function [-Werror=maybe-uninitialized]
      *length = end - offset;
/tmp/qemu-test/src/nbd/server.c:1940:30: note: 'end' was declared here
      uint64_t begin = offset, end;
cc1: all warnings being treated as errors
make: *** [/tmp/qemu-test/src/rules.mak:69: nbd/server.o] Error 1
make: *** Waiting for unfinished jobs....
Traceback (most recent call last):
   File "./tests/docker/docker.py", line 526, in <module>
   File "./tests/docker/docker.py", line 523, in main
     return args.cmdobj.run(args, argv)
   File "./tests/docker/docker.py", line 279, in run
     return Docker().run(argv, args.keep, quiet=args.quiet)
   File "./tests/docker/docker.py", line 247, in run
   File "./tests/docker/docker.py", line 154, in _do_check
     return subprocess.check_call(self._command + cmd, **kwargs)
   File "/usr/lib64/python2.7/subprocess.py", line 186, in check_call
     raise CalledProcessError(retcode, cmd)
subprocess.CalledProcessError: Command '['docker', 'run', '--label', 
'com.qemu.instance.uuid=830b33d0760d11e888c352540069c830', '-u', '0', 
'--security-opt', 'seccomp=unconfined', '--rm', '--net=none', '-e', 
'TARGET_LIST=', '-e', 'EXTRA_CONFIGURE_OPTS=', '-e', 'V=', '-e', 'J=8', '-e', 
'DEBUG=', '-e', 'SHOW_ENV=1', '-e', 'CCACHE_DIR=/var/tmp/ccache', '-v', 
'/root/.cache/qemu-docker-ccache:/var/tmp/ccache:z', '-v', 
 'qemu:fedora', '/var/tmp/qemu/run', 'test-mingw']' returned non-zero exit 
status 2
make[1]: *** [tests/docker/Makefile.include:164: docker-run] Error 1
make[1]: Leaving directory '/var/tmp/patchew-tester-tmp-2s1zzq00/src'
make: *** [tests/docker/Makefile.include:198: address@hidden Error 2

real    1m34.678s
user    0m5.210s
sys     0m3.979s

This is definitely not me - these 2 patches don't touch anything related to this.



reply via email to

[Prev in Thread] Current Thread [Next in Thread]